glassfish
  1. glassfish
  2. GLASSFISH-17285 Support building with Java SE 7
  3. GLASSFISH-17316

Unit tests that fail randomly (orb-connector) when using JDK7 to build GlassFish from scratch

    Details

    • Type: Sub-task Sub-task
    • Status: Resolved
    • Priority: Major Major
    • Resolution: Fixed
    • Affects Version/s: 4.0
    • Fix Version/s: 4.0_b25
    • Component/s: orb
    • Labels:
      None
    • Environment:

      Ubutu 11.04 (2.6.38-11-generic) ; JDK 1.7.0 ; Maven 2.2.1

      Description

      Some unit tests from "appserver/orb/orb-connector" are failing when using JDK7.

      When trying to build the GlassFish workspace with JDK7 from scratch (from top level directory), the build fails because of some unit tests. According to the following link it seems that these unit tests depends somehow on the order of invocation.

      The behavior is quite random because the unit tests don't fail when you run "mvn clean install" from the appropriate module. Also I've tried several times to build from scratch (i.e. on a fresh checkout) and the tests that fail can be different each time.

      Here is a diff file available as attachment that disable other failing tests so it will be easier to reproduce the bug. For your information: I've reproduced the bug 3 times in 4 trials from fresh checkout + patch.

      ===============================================================================================================================

      • Here is the outputs from Maven:

      ===============================================================================================================================

      -------------------------------------------------------
       T E S T S
      -------------------------------------------------------
      Running org.glassfish.orb.admin.cli.ListIiopListenersTest
      Sep 19, 2011 11:33:54 AM org.jvnet.hk2.component.ContractLocatorImpl warnOnUsage
      WARNING: name and scope are currently only appropriate for byContract usage; (name: default-instance-name; type: com.sun.enterprise.config.serverbeans.JavaConfig)
      Sep 19, 2011 11:33:54 AM org.jvnet.hk2.component.ContractLocatorImpl warnOnUsage
      WARNING: name and scope are currently only appropriate for byContract usage; (name: default-instance-name; type: com.sun.enterprise.config.serverbeans.Server)
      Sep 19, 2011 11:33:54 AM org.jvnet.hk2.config.ConfigParser handleElement
      SEVERE: Ignoring unrecognized element management-rules at Line number = 169
      Column number = 42
      System Id = file:/home/romano/workspaces/glassfish/main-scratch-jdk7_14/appserver/orb/orb-connector/target/test-classes/DomainTest.xml
      Public Id = null
      Location Uri= file:/home/romano/workspaces/glassfish/main-scratch-jdk7_14/appserver/orb/orb-connector/target/test-classes/DomainTest.xml
      CharacterOffset = 10320
      
      Sep 19, 2011 11:33:54 AM org.hibernate.validator.util.Version <clinit>
      INFO: Hibernate Validator 4.1.0.Final
      Sep 19, 2011 11:33:54 AM org.hibernate.validator.engine.resolver.DefaultTraversableResolver detectJPA
      INFO: Instantiated an instance of org.hibernate.validator.engine.resolver.JPATraversableResolver.
      Tests run: 4, Failures: 1, Errors: 0, Skipped: 0, Time elapsed: 0.4 sec <<< FAILURE!
      Running org.glassfish.orb.admin.cli.CreateIiopListenerTest
      Tests run: 6, Failures: 6, Errors: 0, Skipped: 0, Time elapsed: 0.041 sec <<< FAILURE!
      Running org.glassfish.orb.admin.cli.DeleteIiopListenerTest
      Tests run: 2, Failures: 1, Errors: 0, Skipped: 0, Time elapsed: 0.014 sec <<< FAILURE!
      Running org.glassfish.orb.admin.cli.TestDocument
      Tests run: 1, Failures: 0, Errors: 0, Skipped: 1, Time elapsed: 0.001 sec
      
      Results :
      
      Failed tests: 
        testExecuteSuccessListNoListener(org.glassfish.orb.admin.cli.ListIiopListenersTest)
        testExecuteSuccess(org.glassfish.orb.admin.cli.CreateIiopListenerTest)
        testExecuteSuccessDefaultValues(org.glassfish.orb.admin.cli.CreateIiopListenerTest)
        testExecuteSuccessNoValueOptionEnabled(org.glassfish.orb.admin.cli.CreateIiopListenerTest)
        testExecuteFailDuplicateListener(org.glassfish.orb.admin.cli.CreateIiopListenerTest)
        testExecuteFailForSamePortAndListenerAddress(org.glassfish.orb.admin.cli.CreateIiopListenerTest)
        testExecuteSuccessNoValueOptionSecurityEnabled(org.glassfish.orb.admin.cli.CreateIiopListenerTest)
        testExecuteSuccessDefaultTarget(org.glassfish.orb.admin.cli.DeleteIiopListenerTest)
      
      Tests run: 13, Failures: 8, Errors: 0, Skipped: 1
      
      [INFO] ------------------------------------------------------------------------
      [ERROR] BUILD FAILURE
      [INFO] ------------------------------------------------------------------------
      [INFO] There are test failures.
      
      Please refer to /home/romano/workspaces/glassfish/main-scratch-jdk7_14/appserver/orb/orb-connector/target/surefire-reports for the individual test results.
      [INFO] ------------------------------------------------------------------------
      [INFO] For more information, run Maven with the -e switch
      [INFO] ------------------------------------------------------------------------
      [INFO] Total time: 4 minutes 39 seconds
      [INFO] Finished at: Mon Sep 19 11:33:54 CEST 2011
      [INFO] Final Memory: 329M/645M
      [INFO] ------------------------------------------------------------------------
      

      ===============================================================================================================================

      • Here are the surfire report:

      ===============================================================================================================================

      -------------------------------------------------------------------------------
      Test set: org.glassfish.orb.admin.cli.CreateIiopListenerTest
      -------------------------------------------------------------------------------
      Tests run: 6, Failures: 6, Errors: 0, Skipped: 0, Time elapsed: 0.041 sec <<< FAILURE!
      testExecuteSuccess(org.glassfish.orb.admin.cli.CreateIiopListenerTest)  Time elapsed: 0.009 sec  <<< FAILURE!
      java.lang.AssertionError: expected:<SUCCESS> but was:<FAILURE>
      	at org.junit.Assert.fail(Assert.java:71)
      	at org.junit.Assert.failNotEquals(Assert.java:451)
      	at org.junit.Assert.assertEquals(Assert.java:99)
      	at org.junit.Assert.assertEquals(Assert.java:116)
      	at org.glassfish.orb.admin.cli.CreateIiopListenerTest.testExecuteSuccess(CreateIiopListenerTest.java:128)
      	at sun.reflect.NativeMethodAccessorImpl.invoke0(Native Method)
      	at sun.reflect.NativeMethodAccessorImpl.invoke(NativeMethodAccessorImpl.java:57)
      	at sun.reflect.DelegatingMethodAccessorImpl.invoke(DelegatingMethodAccessorImpl.java:43)
      	at java.lang.reflect.Method.invoke(Method.java:601)
      	at org.junit.internal.runners.TestMethodRunner.executeMethodBody(TestMethodRunner.java:99)
      	at org.junit.internal.runners.TestMethodRunner.runUnprotected(TestMethodRunner.java:81)
      	at org.junit.internal.runners.BeforeAndAfterRunner.runProtected(BeforeAndAfterRunner.java:34)
      	at org.junit.internal.runners.TestMethodRunner.runMethod(TestMethodRunner.java:75)
      	at org.junit.internal.runners.TestMethodRunner.run(TestMethodRunner.java:45)
      	at org.junit.internal.runners.TestClassMethodsRunner.invokeTestMethod(TestClassMethodsRunner.java:66)
      	at org.junit.internal.runners.TestClassMethodsRunner.run(TestClassMethodsRunner.java:35)
      	at org.junit.internal.runners.TestClassRunner$1.runUnprotected(TestClassRunner.java:42)
      	at org.junit.internal.runners.BeforeAndAfterRunner.runProtected(BeforeAndAfterRunner.java:34)
      	at org.junit.internal.runners.TestClassRunner.run(TestClassRunner.java:52)
      	at org.apache.maven.surefire.junit4.JUnit4TestSet.execute(JUnit4TestSet.java:62)
      	at org.apache.maven.surefire.suite.AbstractDirectoryTestSuite.executeTestSet(AbstractDirectoryTestSuite.java:140)
      	at org.apache.maven.surefire.suite.AbstractDirectoryTestSuite.execute(AbstractDirectoryTestSuite.java:127)
      	at org.apache.maven.surefire.Surefire.run(Surefire.java:177)
      	at sun.reflect.NativeMethodAccessorImpl.invoke0(Native Method)
      	at sun.reflect.NativeMethodAccessorImpl.invoke(NativeMethodAccessorImpl.java:57)
      	at sun.reflect.DelegatingMethodAccessorImpl.invoke(DelegatingMethodAccessorImpl.java:43)
      	at java.lang.reflect.Method.invoke(Method.java:601)
      	at org.apache.maven.surefire.booter.SurefireBooter.runSuitesInProcess(SurefireBooter.java:345)
      	at org.apache.maven.surefire.booter.SurefireBooter.run(SurefireBooter.java:241)
      	at org.apache.maven.plugin.surefire.SurefirePlugin.execute(SurefirePlugin.java:537)
      	at org.apache.maven.plugin.DefaultPluginManager.executeMojo(DefaultPluginManager.java:490)
      	at org.apache.maven.lifecycle.DefaultLifecycleExecutor.executeGoals(DefaultLifecycleExecutor.java:694)
      	at org.apache.maven.lifecycle.DefaultLifecycleExecutor.executeGoalWithLifecycle(DefaultLifecycleExecutor.java:556)
      	at org.apache.maven.lifecycle.DefaultLifecycleExecutor.executeGoal(DefaultLifecycleExecutor.java:535)
      	at org.apache.maven.lifecycle.DefaultLifecycleExecutor.executeGoalAndHandleFailures(DefaultLifecycleExecutor.java:387)
      	at org.apache.maven.lifecycle.DefaultLifecycleExecutor.executeTaskSegments(DefaultLifecycleExecutor.java:348)
      	at org.apache.maven.lifecycle.DefaultLifecycleExecutor.execute(DefaultLifecycleExecutor.java:180)
      	at org.apache.maven.DefaultMaven.doExecute(DefaultMaven.java:328)
      	at org.apache.maven.DefaultMaven.execute(DefaultMaven.java:138)
      	at org.apache.maven.cli.MavenCli.main(MavenCli.java:362)
      	at org.apache.maven.cli.compat.CompatibleMain.main(CompatibleMain.java:60)
      	at sun.reflect.NativeMethodAccessorImpl.invoke0(Native Method)
      	at sun.reflect.NativeMethodAccessorImpl.invoke(NativeMethodAccessorImpl.java:57)
      	at sun.reflect.DelegatingMethodAccessorImpl.invoke(DelegatingMethodAccessorImpl.java:43)
      	at java.lang.reflect.Method.invoke(Method.java:601)
      	at org.codehaus.classworlds.Launcher.launchEnhanced(Launcher.java:315)
      	at org.codehaus.classworlds.Launcher.launch(Launcher.java:255)
      	at org.codehaus.classworlds.Launcher.mainWithExitCode(Launcher.java:430)
      	at org.codehaus.classworlds.Launcher.main(Launcher.java:375)
      
      testExecuteSuccessDefaultValues(org.glassfish.orb.admin.cli.CreateIiopListenerTest)  Time elapsed: 0.003 sec  <<< FAILURE!
      java.lang.AssertionError: expected:<SUCCESS> but was:<FAILURE>
      	at org.junit.Assert.fail(Assert.java:71)
      	at org.junit.Assert.failNotEquals(Assert.java:451)
      	at org.junit.Assert.assertEquals(Assert.java:99)
      	at org.junit.Assert.assertEquals(Assert.java:116)
      	at org.glassfish.orb.admin.cli.CreateIiopListenerTest.testExecuteSuccessDefaultValues(CreateIiopListenerTest.java:159)
      	at sun.reflect.NativeMethodAccessorImpl.invoke0(Native Method)
      	at sun.reflect.NativeMethodAccessorImpl.invoke(NativeMethodAccessorImpl.java:57)
      	at sun.reflect.DelegatingMethodAccessorImpl.invoke(DelegatingMethodAccessorImpl.java:43)
      	at java.lang.reflect.Method.invoke(Method.java:601)
      	at org.junit.internal.runners.TestMethodRunner.executeMethodBody(TestMethodRunner.java:99)
      	at org.junit.internal.runners.TestMethodRunner.runUnprotected(TestMethodRunner.java:81)
      	at org.junit.internal.runners.BeforeAndAfterRunner.runProtected(BeforeAndAfterRunner.java:34)
      	at org.junit.internal.runners.TestMethodRunner.runMethod(TestMethodRunner.java:75)
      	at org.junit.internal.runners.TestMethodRunner.run(TestMethodRunner.java:45)
      	at org.junit.internal.runners.TestClassMethodsRunner.invokeTestMethod(TestClassMethodsRunner.java:66)
      	at org.junit.internal.runners.TestClassMethodsRunner.run(TestClassMethodsRunner.java:35)
      	at org.junit.internal.runners.TestClassRunner$1.runUnprotected(TestClassRunner.java:42)
      	at org.junit.internal.runners.BeforeAndAfterRunner.runProtected(BeforeAndAfterRunner.java:34)
      	at org.junit.internal.runners.TestClassRunner.run(TestClassRunner.java:52)
      	at org.apache.maven.surefire.junit4.JUnit4TestSet.execute(JUnit4TestSet.java:62)
      	at org.apache.maven.surefire.suite.AbstractDirectoryTestSuite.executeTestSet(AbstractDirectoryTestSuite.java:140)
      	at org.apache.maven.surefire.suite.AbstractDirectoryTestSuite.execute(AbstractDirectoryTestSuite.java:127)
      	at org.apache.maven.surefire.Surefire.run(Surefire.java:177)
      	at sun.reflect.NativeMethodAccessorImpl.invoke0(Native Method)
      	at sun.reflect.NativeMethodAccessorImpl.invoke(NativeMethodAccessorImpl.java:57)
      	at sun.reflect.DelegatingMethodAccessorImpl.invoke(DelegatingMethodAccessorImpl.java:43)
      	at java.lang.reflect.Method.invoke(Method.java:601)
      	at org.apache.maven.surefire.booter.SurefireBooter.runSuitesInProcess(SurefireBooter.java:345)
      	at org.apache.maven.surefire.booter.SurefireBooter.run(SurefireBooter.java:241)
      	at org.apache.maven.plugin.surefire.SurefirePlugin.execute(SurefirePlugin.java:537)
      	at org.apache.maven.plugin.DefaultPluginManager.executeMojo(DefaultPluginManager.java:490)
      	at org.apache.maven.lifecycle.DefaultLifecycleExecutor.executeGoals(DefaultLifecycleExecutor.java:694)
      	at org.apache.maven.lifecycle.DefaultLifecycleExecutor.executeGoalWithLifecycle(DefaultLifecycleExecutor.java:556)
      	at org.apache.maven.lifecycle.DefaultLifecycleExecutor.executeGoal(DefaultLifecycleExecutor.java:535)
      	at org.apache.maven.lifecycle.DefaultLifecycleExecutor.executeGoalAndHandleFailures(DefaultLifecycleExecutor.java:387)
      	at org.apache.maven.lifecycle.DefaultLifecycleExecutor.executeTaskSegments(DefaultLifecycleExecutor.java:348)
      	at org.apache.maven.lifecycle.DefaultLifecycleExecutor.execute(DefaultLifecycleExecutor.java:180)
      	at org.apache.maven.DefaultMaven.doExecute(DefaultMaven.java:328)
      	at org.apache.maven.DefaultMaven.execute(DefaultMaven.java:138)
      	at org.apache.maven.cli.MavenCli.main(MavenCli.java:362)
      	at org.apache.maven.cli.compat.CompatibleMain.main(CompatibleMain.java:60)
      	at sun.reflect.NativeMethodAccessorImpl.invoke0(Native Method)
      	at sun.reflect.NativeMethodAccessorImpl.invoke(NativeMethodAccessorImpl.java:57)
      	at sun.reflect.DelegatingMethodAccessorImpl.invoke(DelegatingMethodAccessorImpl.java:43)
      	at java.lang.reflect.Method.invoke(Method.java:601)
      	at org.codehaus.classworlds.Launcher.launchEnhanced(Launcher.java:315)
      	at org.codehaus.classworlds.Launcher.launch(Launcher.java:255)
      	at org.codehaus.classworlds.Launcher.mainWithExitCode(Launcher.java:430)
      	at org.codehaus.classworlds.Launcher.main(Launcher.java:375)
      
      testExecuteSuccessNoValueOptionEnabled(org.glassfish.orb.admin.cli.CreateIiopListenerTest)  Time elapsed: 0.007 sec  <<< FAILURE!
      java.lang.AssertionError: expected:<SUCCESS> but was:<FAILURE>
      	at org.junit.Assert.fail(Assert.java:71)
      	at org.junit.Assert.failNotEquals(Assert.java:451)
      	at org.junit.Assert.assertEquals(Assert.java:99)
      	at org.junit.Assert.assertEquals(Assert.java:116)
      	at org.glassfish.orb.admin.cli.CreateIiopListenerTest.testExecuteSuccessNoValueOptionEnabled(CreateIiopListenerTest.java:288)
      	at sun.reflect.NativeMethodAccessorImpl.invoke0(Native Method)
      	at sun.reflect.NativeMethodAccessorImpl.invoke(NativeMethodAccessorImpl.java:57)
      	at sun.reflect.DelegatingMethodAccessorImpl.invoke(DelegatingMethodAccessorImpl.java:43)
      	at java.lang.reflect.Method.invoke(Method.java:601)
      	at org.junit.internal.runners.TestMethodRunner.executeMethodBody(TestMethodRunner.java:99)
      	at org.junit.internal.runners.TestMethodRunner.runUnprotected(TestMethodRunner.java:81)
      	at org.junit.internal.runners.BeforeAndAfterRunner.runProtected(BeforeAndAfterRunner.java:34)
      	at org.junit.internal.runners.TestMethodRunner.runMethod(TestMethodRunner.java:75)
      	at org.junit.internal.runners.TestMethodRunner.run(TestMethodRunner.java:45)
      	at org.junit.internal.runners.TestClassMethodsRunner.invokeTestMethod(TestClassMethodsRunner.java:66)
      	at org.junit.internal.runners.TestClassMethodsRunner.run(TestClassMethodsRunner.java:35)
      	at org.junit.internal.runners.TestClassRunner$1.runUnprotected(TestClassRunner.java:42)
      	at org.junit.internal.runners.BeforeAndAfterRunner.runProtected(BeforeAndAfterRunner.java:34)
      	at org.junit.internal.runners.TestClassRunner.run(TestClassRunner.java:52)
      	at org.apache.maven.surefire.junit4.JUnit4TestSet.execute(JUnit4TestSet.java:62)
      	at org.apache.maven.surefire.suite.AbstractDirectoryTestSuite.executeTestSet(AbstractDirectoryTestSuite.java:140)
      	at org.apache.maven.surefire.suite.AbstractDirectoryTestSuite.execute(AbstractDirectoryTestSuite.java:127)
      	at org.apache.maven.surefire.Surefire.run(Surefire.java:177)
      	at sun.reflect.NativeMethodAccessorImpl.invoke0(Native Method)
      	at sun.reflect.NativeMethodAccessorImpl.invoke(NativeMethodAccessorImpl.java:57)
      	at sun.reflect.DelegatingMethodAccessorImpl.invoke(DelegatingMethodAccessorImpl.java:43)
      	at java.lang.reflect.Method.invoke(Method.java:601)
      	at org.apache.maven.surefire.booter.SurefireBooter.runSuitesInProcess(SurefireBooter.java:345)
      	at org.apache.maven.surefire.booter.SurefireBooter.run(SurefireBooter.java:241)
      	at org.apache.maven.plugin.surefire.SurefirePlugin.execute(SurefirePlugin.java:537)
      	at org.apache.maven.plugin.DefaultPluginManager.executeMojo(DefaultPluginManager.java:490)
      	at org.apache.maven.lifecycle.DefaultLifecycleExecutor.executeGoals(DefaultLifecycleExecutor.java:694)
      	at org.apache.maven.lifecycle.DefaultLifecycleExecutor.executeGoalWithLifecycle(DefaultLifecycleExecutor.java:556)
      	at org.apache.maven.lifecycle.DefaultLifecycleExecutor.executeGoal(DefaultLifecycleExecutor.java:535)
      	at org.apache.maven.lifecycle.DefaultLifecycleExecutor.executeGoalAndHandleFailures(DefaultLifecycleExecutor.java:387)
      	at org.apache.maven.lifecycle.DefaultLifecycleExecutor.executeTaskSegments(DefaultLifecycleExecutor.java:348)
      	at org.apache.maven.lifecycle.DefaultLifecycleExecutor.execute(DefaultLifecycleExecutor.java:180)
      	at org.apache.maven.DefaultMaven.doExecute(DefaultMaven.java:328)
      	at org.apache.maven.DefaultMaven.execute(DefaultMaven.java:138)
      	at org.apache.maven.cli.MavenCli.main(MavenCli.java:362)
      	at org.apache.maven.cli.compat.CompatibleMain.main(CompatibleMain.java:60)
      	at sun.reflect.NativeMethodAccessorImpl.invoke0(Native Method)
      	at sun.reflect.NativeMethodAccessorImpl.invoke(NativeMethodAccessorImpl.java:57)
      	at sun.reflect.DelegatingMethodAccessorImpl.invoke(DelegatingMethodAccessorImpl.java:43)
      	at java.lang.reflect.Method.invoke(Method.java:601)
      	at org.codehaus.classworlds.Launcher.launchEnhanced(Launcher.java:315)
      	at org.codehaus.classworlds.Launcher.launch(Launcher.java:255)
      	at org.codehaus.classworlds.Launcher.mainWithExitCode(Launcher.java:430)
      	at org.codehaus.classworlds.Launcher.main(Launcher.java:375)
      
      testExecuteFailDuplicateListener(org.glassfish.orb.admin.cli.CreateIiopListenerTest)  Time elapsed: 0.003 sec  <<< FAILURE!
      java.lang.AssertionError: expected:<SUCCESS> but was:<FAILURE>
      	at org.junit.Assert.fail(Assert.java:71)
      	at org.junit.Assert.failNotEquals(Assert.java:451)
      	at org.junit.Assert.assertEquals(Assert.java:99)
      	at org.junit.Assert.assertEquals(Assert.java:116)
      	at org.glassfish.orb.admin.cli.CreateIiopListenerTest.testExecuteFailDuplicateListener(CreateIiopListenerTest.java:190)
      	at sun.reflect.NativeMethodAccessorImpl.invoke0(Native Method)
      	at sun.reflect.NativeMethodAccessorImpl.invoke(NativeMethodAccessorImpl.java:57)
      	at sun.reflect.DelegatingMethodAccessorImpl.invoke(DelegatingMethodAccessorImpl.java:43)
      	at java.lang.reflect.Method.invoke(Method.java:601)
      	at org.junit.internal.runners.TestMethodRunner.executeMethodBody(TestMethodRunner.java:99)
      	at org.junit.internal.runners.TestMethodRunner.runUnprotected(TestMethodRunner.java:81)
      	at org.junit.internal.runners.BeforeAndAfterRunner.runProtected(BeforeAndAfterRunner.java:34)
      	at org.junit.internal.runners.TestMethodRunner.runMethod(TestMethodRunner.java:75)
      	at org.junit.internal.runners.TestMethodRunner.run(TestMethodRunner.java:45)
      	at org.junit.internal.runners.TestClassMethodsRunner.invokeTestMethod(TestClassMethodsRunner.java:66)
      	at org.junit.internal.runners.TestClassMethodsRunner.run(TestClassMethodsRunner.java:35)
      	at org.junit.internal.runners.TestClassRunner$1.runUnprotected(TestClassRunner.java:42)
      	at org.junit.internal.runners.BeforeAndAfterRunner.runProtected(BeforeAndAfterRunner.java:34)
      	at org.junit.internal.runners.TestClassRunner.run(TestClassRunner.java:52)
      	at org.apache.maven.surefire.junit4.JUnit4TestSet.execute(JUnit4TestSet.java:62)
      	at org.apache.maven.surefire.suite.AbstractDirectoryTestSuite.executeTestSet(AbstractDirectoryTestSuite.java:140)
      	at org.apache.maven.surefire.suite.AbstractDirectoryTestSuite.execute(AbstractDirectoryTestSuite.java:127)
      	at org.apache.maven.surefire.Surefire.run(Surefire.java:177)
      	at sun.reflect.NativeMethodAccessorImpl.invoke0(Native Method)
      	at sun.reflect.NativeMethodAccessorImpl.invoke(NativeMethodAccessorImpl.java:57)
      	at sun.reflect.DelegatingMethodAccessorImpl.invoke(DelegatingMethodAccessorImpl.java:43)
      	at java.lang.reflect.Method.invoke(Method.java:601)
      	at org.apache.maven.surefire.booter.SurefireBooter.runSuitesInProcess(SurefireBooter.java:345)
      	at org.apache.maven.surefire.booter.SurefireBooter.run(SurefireBooter.java:241)
      	at org.apache.maven.plugin.surefire.SurefirePlugin.execute(SurefirePlugin.java:537)
      	at org.apache.maven.plugin.DefaultPluginManager.executeMojo(DefaultPluginManager.java:490)
      	at org.apache.maven.lifecycle.DefaultLifecycleExecutor.executeGoals(DefaultLifecycleExecutor.java:694)
      	at org.apache.maven.lifecycle.DefaultLifecycleExecutor.executeGoalWithLifecycle(DefaultLifecycleExecutor.java:556)
      	at org.apache.maven.lifecycle.DefaultLifecycleExecutor.executeGoal(DefaultLifecycleExecutor.java:535)
      	at org.apache.maven.lifecycle.DefaultLifecycleExecutor.executeGoalAndHandleFailures(DefaultLifecycleExecutor.java:387)
      	at org.apache.maven.lifecycle.DefaultLifecycleExecutor.executeTaskSegments(DefaultLifecycleExecutor.java:348)
      	at org.apache.maven.lifecycle.DefaultLifecycleExecutor.execute(DefaultLifecycleExecutor.java:180)
      	at org.apache.maven.DefaultMaven.doExecute(DefaultMaven.java:328)
      	at org.apache.maven.DefaultMaven.execute(DefaultMaven.java:138)
      	at org.apache.maven.cli.MavenCli.main(MavenCli.java:362)
      	at org.apache.maven.cli.compat.CompatibleMain.main(CompatibleMain.java:60)
      	at sun.reflect.NativeMethodAccessorImpl.invoke0(Native Method)
      	at sun.reflect.NativeMethodAccessorImpl.invoke(NativeMethodAccessorImpl.java:57)
      	at sun.reflect.DelegatingMethodAccessorImpl.invoke(DelegatingMethodAccessorImpl.java:43)
      	at java.lang.reflect.Method.invoke(Method.java:601)
      	at org.codehaus.classworlds.Launcher.launchEnhanced(Launcher.java:315)
      	at org.codehaus.classworlds.Launcher.launch(Launcher.java:255)
      	at org.codehaus.classworlds.Launcher.mainWithExitCode(Launcher.java:430)
      	at org.codehaus.classworlds.Launcher.main(Launcher.java:375)
      
      testExecuteFailForSamePortAndListenerAddress(org.glassfish.orb.admin.cli.CreateIiopListenerTest)  Time elapsed: 0.005 sec  <<< FAILURE!
      java.lang.AssertionError: expected:<SUCCESS> but was:<FAILURE>
      	at org.junit.Assert.fail(Assert.java:71)
      	at org.junit.Assert.failNotEquals(Assert.java:451)
      	at org.junit.Assert.assertEquals(Assert.java:99)
      	at org.junit.Assert.assertEquals(Assert.java:116)
      	at org.glassfish.orb.admin.cli.CreateIiopListenerTest.testExecuteFailForSamePortAndListenerAddress(CreateIiopListenerTest.java:234)
      	at sun.reflect.NativeMethodAccessorImpl.invoke0(Native Method)
      	at sun.reflect.NativeMethodAccessorImpl.invoke(NativeMethodAccessorImpl.java:57)
      	at sun.reflect.DelegatingMethodAccessorImpl.invoke(DelegatingMethodAccessorImpl.java:43)
      	at java.lang.reflect.Method.invoke(Method.java:601)
      	at org.junit.internal.runners.TestMethodRunner.executeMethodBody(TestMethodRunner.java:99)
      	at org.junit.internal.runners.TestMethodRunner.runUnprotected(TestMethodRunner.java:81)
      	at org.junit.internal.runners.BeforeAndAfterRunner.runProtected(BeforeAndAfterRunner.java:34)
      	at org.junit.internal.runners.TestMethodRunner.runMethod(TestMethodRunner.java:75)
      	at org.junit.internal.runners.TestMethodRunner.run(TestMethodRunner.java:45)
      	at org.junit.internal.runners.TestClassMethodsRunner.invokeTestMethod(TestClassMethodsRunner.java:66)
      	at org.junit.internal.runners.TestClassMethodsRunner.run(TestClassMethodsRunner.java:35)
      	at org.junit.internal.runners.TestClassRunner$1.runUnprotected(TestClassRunner.java:42)
      	at org.junit.internal.runners.BeforeAndAfterRunner.runProtected(BeforeAndAfterRunner.java:34)
      	at org.junit.internal.runners.TestClassRunner.run(TestClassRunner.java:52)
      	at org.apache.maven.surefire.junit4.JUnit4TestSet.execute(JUnit4TestSet.java:62)
      	at org.apache.maven.surefire.suite.AbstractDirectoryTestSuite.executeTestSet(AbstractDirectoryTestSuite.java:140)
      	at org.apache.maven.surefire.suite.AbstractDirectoryTestSuite.execute(AbstractDirectoryTestSuite.java:127)
      	at org.apache.maven.surefire.Surefire.run(Surefire.java:177)
      	at sun.reflect.NativeMethodAccessorImpl.invoke0(Native Method)
      	at sun.reflect.NativeMethodAccessorImpl.invoke(NativeMethodAccessorImpl.java:57)
      	at sun.reflect.DelegatingMethodAccessorImpl.invoke(DelegatingMethodAccessorImpl.java:43)
      	at java.lang.reflect.Method.invoke(Method.java:601)
      	at org.apache.maven.surefire.booter.SurefireBooter.runSuitesInProcess(SurefireBooter.java:345)
      	at org.apache.maven.surefire.booter.SurefireBooter.run(SurefireBooter.java:241)
      	at org.apache.maven.plugin.surefire.SurefirePlugin.execute(SurefirePlugin.java:537)
      	at org.apache.maven.plugin.DefaultPluginManager.executeMojo(DefaultPluginManager.java:490)
      	at org.apache.maven.lifecycle.DefaultLifecycleExecutor.executeGoals(DefaultLifecycleExecutor.java:694)
      	at org.apache.maven.lifecycle.DefaultLifecycleExecutor.executeGoalWithLifecycle(DefaultLifecycleExecutor.java:556)
      	at org.apache.maven.lifecycle.DefaultLifecycleExecutor.executeGoal(DefaultLifecycleExecutor.java:535)
      	at org.apache.maven.lifecycle.DefaultLifecycleExecutor.executeGoalAndHandleFailures(DefaultLifecycleExecutor.java:387)
      	at org.apache.maven.lifecycle.DefaultLifecycleExecutor.executeTaskSegments(DefaultLifecycleExecutor.java:348)
      	at org.apache.maven.lifecycle.DefaultLifecycleExecutor.execute(DefaultLifecycleExecutor.java:180)
      	at org.apache.maven.DefaultMaven.doExecute(DefaultMaven.java:328)
      	at org.apache.maven.DefaultMaven.execute(DefaultMaven.java:138)
      	at org.apache.maven.cli.MavenCli.main(MavenCli.java:362)
      	at org.apache.maven.cli.compat.CompatibleMain.main(CompatibleMain.java:60)
      	at sun.reflect.NativeMethodAccessorImpl.invoke0(Native Method)
      	at sun.reflect.NativeMethodAccessorImpl.invoke(NativeMethodAccessorImpl.java:57)
      	at sun.reflect.DelegatingMethodAccessorImpl.invoke(DelegatingMethodAccessorImpl.java:43)
      	at java.lang.reflect.Method.invoke(Method.java:601)
      	at org.codehaus.classworlds.Launcher.launchEnhanced(Launcher.java:315)
      	at org.codehaus.classworlds.Launcher.launch(Launcher.java:255)
      	at org.codehaus.classworlds.Launcher.mainWithExitCode(Launcher.java:430)
      	at org.codehaus.classworlds.Launcher.main(Launcher.java:375)
      
      testExecuteSuccessNoValueOptionSecurityEnabled(org.glassfish.orb.admin.cli.CreateIiopListenerTest)  Time elapsed: 0.004 sec  <<< FAILURE!
      java.lang.AssertionError: expected:<SUCCESS> but was:<FAILURE>
      	at org.junit.Assert.fail(Assert.java:71)
      	at org.junit.Assert.failNotEquals(Assert.java:451)
      	at org.junit.Assert.assertEquals(Assert.java:99)
      	at org.junit.Assert.assertEquals(Assert.java:116)
      	at org.glassfish.orb.admin.cli.CreateIiopListenerTest.testExecuteSuccessNoValueOptionSecurityEnabled(CreateIiopListenerTest.java:318)
      	at sun.reflect.NativeMethodAccessorImpl.invoke0(Native Method)
      	at sun.reflect.NativeMethodAccessorImpl.invoke(NativeMethodAccessorImpl.java:57)
      	at sun.reflect.DelegatingMethodAccessorImpl.invoke(DelegatingMethodAccessorImpl.java:43)
      	at java.lang.reflect.Method.invoke(Method.java:601)
      	at org.junit.internal.runners.TestMethodRunner.executeMethodBody(TestMethodRunner.java:99)
      	at org.junit.internal.runners.TestMethodRunner.runUnprotected(TestMethodRunner.java:81)
      	at org.junit.internal.runners.BeforeAndAfterRunner.runProtected(BeforeAndAfterRunner.java:34)
      	at org.junit.internal.runners.TestMethodRunner.runMethod(TestMethodRunner.java:75)
      	at org.junit.internal.runners.TestMethodRunner.run(TestMethodRunner.java:45)
      	at org.junit.internal.runners.TestClassMethodsRunner.invokeTestMethod(TestClassMethodsRunner.java:66)
      	at org.junit.internal.runners.TestClassMethodsRunner.run(TestClassMethodsRunner.java:35)
      	at org.junit.internal.runners.TestClassRunner$1.runUnprotected(TestClassRunner.java:42)
      	at org.junit.internal.runners.BeforeAndAfterRunner.runProtected(BeforeAndAfterRunner.java:34)
      	at org.junit.internal.runners.TestClassRunner.run(TestClassRunner.java:52)
      	at org.apache.maven.surefire.junit4.JUnit4TestSet.execute(JUnit4TestSet.java:62)
      	at org.apache.maven.surefire.suite.AbstractDirectoryTestSuite.executeTestSet(AbstractDirectoryTestSuite.java:140)
      	at org.apache.maven.surefire.suite.AbstractDirectoryTestSuite.execute(AbstractDirectoryTestSuite.java:127)
      	at org.apache.maven.surefire.Surefire.run(Surefire.java:177)
      	at sun.reflect.NativeMethodAccessorImpl.invoke0(Native Method)
      	at sun.reflect.NativeMethodAccessorImpl.invoke(NativeMethodAccessorImpl.java:57)
      	at sun.reflect.DelegatingMethodAccessorImpl.invoke(DelegatingMethodAccessorImpl.java:43)
      	at java.lang.reflect.Method.invoke(Method.java:601)
      	at org.apache.maven.surefire.booter.SurefireBooter.runSuitesInProcess(SurefireBooter.java:345)
      	at org.apache.maven.surefire.booter.SurefireBooter.run(SurefireBooter.java:241)
      	at org.apache.maven.plugin.surefire.SurefirePlugin.execute(SurefirePlugin.java:537)
      	at org.apache.maven.plugin.DefaultPluginManager.executeMojo(DefaultPluginManager.java:490)
      	at org.apache.maven.lifecycle.DefaultLifecycleExecutor.executeGoals(DefaultLifecycleExecutor.java:694)
      	at org.apache.maven.lifecycle.DefaultLifecycleExecutor.executeGoalWithLifecycle(DefaultLifecycleExecutor.java:556)
      	at org.apache.maven.lifecycle.DefaultLifecycleExecutor.executeGoal(DefaultLifecycleExecutor.java:535)
      	at org.apache.maven.lifecycle.DefaultLifecycleExecutor.executeGoalAndHandleFailures(DefaultLifecycleExecutor.java:387)
      	at org.apache.maven.lifecycle.DefaultLifecycleExecutor.executeTaskSegments(DefaultLifecycleExecutor.java:348)
      	at org.apache.maven.lifecycle.DefaultLifecycleExecutor.execute(DefaultLifecycleExecutor.java:180)
      	at org.apache.maven.DefaultMaven.doExecute(DefaultMaven.java:328)
      	at org.apache.maven.DefaultMaven.execute(DefaultMaven.java:138)
      	at org.apache.maven.cli.MavenCli.main(MavenCli.java:362)
      	at org.apache.maven.cli.compat.CompatibleMain.main(CompatibleMain.java:60)
      	at sun.reflect.NativeMethodAccessorImpl.invoke0(Native Method)
      	at sun.reflect.NativeMethodAccessorImpl.invoke(NativeMethodAccessorImpl.java:57)
      	at sun.reflect.DelegatingMethodAccessorImpl.invoke(DelegatingMethodAccessorImpl.java:43)
      	at java.lang.reflect.Method.invoke(Method.java:601)
      	at org.codehaus.classworlds.Launcher.launchEnhanced(Launcher.java:315)
      	at org.codehaus.classworlds.Launcher.launch(Launcher.java:255)
      	at org.codehaus.classworlds.Launcher.mainWithExitCode(Launcher.java:430)
      	at org.codehaus.classworlds.Launcher.main(Launcher.java:375)
      
      -------------------------------------------------------------------------------
      Test set: org.glassfish.orb.admin.cli.DeleteIiopListenerTest
      -------------------------------------------------------------------------------
      Tests run: 2, Failures: 1, Errors: 0, Skipped: 0, Time elapsed: 0.014 sec <<< FAILURE!
      testExecuteSuccessDefaultTarget(org.glassfish.orb.admin.cli.DeleteIiopListenerTest)  Time elapsed: 0.006 sec  <<< FAILURE!
      java.lang.AssertionError: expected:<SUCCESS> but was:<FAILURE>
      	at org.junit.Assert.fail(Assert.java:71)
      	at org.junit.Assert.failNotEquals(Assert.java:451)
      	at org.junit.Assert.assertEquals(Assert.java:99)
      	at org.junit.Assert.assertEquals(Assert.java:116)
      	at org.glassfish.orb.admin.cli.DeleteIiopListenerTest.testExecuteSuccessDefaultTarget(DeleteIiopListenerTest.java:124)
      	at sun.reflect.NativeMethodAccessorImpl.invoke0(Native Method)
      	at sun.reflect.NativeMethodAccessorImpl.invoke(NativeMethodAccessorImpl.java:57)
      	at sun.reflect.DelegatingMethodAccessorImpl.invoke(DelegatingMethodAccessorImpl.java:43)
      	at java.lang.reflect.Method.invoke(Method.java:601)
      	at org.junit.internal.runners.TestMethodRunner.executeMethodBody(TestMethodRunner.java:99)
      	at org.junit.internal.runners.TestMethodRunner.runUnprotected(TestMethodRunner.java:81)
      	at org.junit.internal.runners.BeforeAndAfterRunner.runProtected(BeforeAndAfterRunner.java:34)
      	at org.junit.internal.runners.TestMethodRunner.runMethod(TestMethodRunner.java:75)
      	at org.junit.internal.runners.TestMethodRunner.run(TestMethodRunner.java:45)
      	at org.junit.internal.runners.TestClassMethodsRunner.invokeTestMethod(TestClassMethodsRunner.java:66)
      	at org.junit.internal.runners.TestClassMethodsRunner.run(TestClassMethodsRunner.java:35)
      	at org.junit.internal.runners.TestClassRunner$1.runUnprotected(TestClassRunner.java:42)
      	at org.junit.internal.runners.BeforeAndAfterRunner.runProtected(BeforeAndAfterRunner.java:34)
      	at org.junit.internal.runners.TestClassRunner.run(TestClassRunner.java:52)
      	at org.apache.maven.surefire.junit4.JUnit4TestSet.execute(JUnit4TestSet.java:62)
      	at org.apache.maven.surefire.suite.AbstractDirectoryTestSuite.executeTestSet(AbstractDirectoryTestSuite.java:140)
      	at org.apache.maven.surefire.suite.AbstractDirectoryTestSuite.execute(AbstractDirectoryTestSuite.java:127)
      	at org.apache.maven.surefire.Surefire.run(Surefire.java:177)
      	at sun.reflect.NativeMethodAccessorImpl.invoke0(Native Method)
      	at sun.reflect.NativeMethodAccessorImpl.invoke(NativeMethodAccessorImpl.java:57)
      	at sun.reflect.DelegatingMethodAccessorImpl.invoke(DelegatingMethodAccessorImpl.java:43)
      	at java.lang.reflect.Method.invoke(Method.java:601)
      	at org.apache.maven.surefire.booter.SurefireBooter.runSuitesInProcess(SurefireBooter.java:345)
      	at org.apache.maven.surefire.booter.SurefireBooter.run(SurefireBooter.java:241)
      	at org.apache.maven.plugin.surefire.SurefirePlugin.execute(SurefirePlugin.java:537)
      	at org.apache.maven.plugin.DefaultPluginManager.executeMojo(DefaultPluginManager.java:490)
      	at org.apache.maven.lifecycle.DefaultLifecycleExecutor.executeGoals(DefaultLifecycleExecutor.java:694)
      	at org.apache.maven.lifecycle.DefaultLifecycleExecutor.executeGoalWithLifecycle(DefaultLifecycleExecutor.java:556)
      	at org.apache.maven.lifecycle.DefaultLifecycleExecutor.executeGoal(DefaultLifecycleExecutor.java:535)
      	at org.apache.maven.lifecycle.DefaultLifecycleExecutor.executeGoalAndHandleFailures(DefaultLifecycleExecutor.java:387)
      	at org.apache.maven.lifecycle.DefaultLifecycleExecutor.executeTaskSegments(DefaultLifecycleExecutor.java:348)
      	at org.apache.maven.lifecycle.DefaultLifecycleExecutor.execute(DefaultLifecycleExecutor.java:180)
      	at org.apache.maven.DefaultMaven.doExecute(DefaultMaven.java:328)
      	at org.apache.maven.DefaultMaven.execute(DefaultMaven.java:138)
      	at org.apache.maven.cli.MavenCli.main(MavenCli.java:362)
      	at org.apache.maven.cli.compat.CompatibleMain.main(CompatibleMain.java:60)
      	at sun.reflect.NativeMethodAccessorImpl.invoke0(Native Method)
      	at sun.reflect.NativeMethodAccessorImpl.invoke(NativeMethodAccessorImpl.java:57)
      	at sun.reflect.DelegatingMethodAccessorImpl.invoke(DelegatingMethodAccessorImpl.java:43)
      	at java.lang.reflect.Method.invoke(Method.java:601)
      	at org.codehaus.classworlds.Launcher.launchEnhanced(Launcher.java:315)
      	at org.codehaus.classworlds.Launcher.launch(Launcher.java:255)
      	at org.codehaus.classworlds.Launcher.mainWithExitCode(Launcher.java:430)
      	at org.codehaus.classworlds.Launcher.main(Launcher.java:375)
      
      -------------------------------------------------------------------------------
      Test set: org.glassfish.orb.admin.cli.ListIiopListenersTest
      -------------------------------------------------------------------------------
      Tests run: 4, Failures: 1, Errors: 0, Skipped: 0, Time elapsed: 0.4 sec <<< FAILURE!
      testExecuteSuccessListNoListener(org.glassfish.orb.admin.cli.ListIiopListenersTest)  Time elapsed: 0.005 sec  <<< FAILURE!
      java.lang.AssertionError: expected:<SUCCESS> but was:<FAILURE>
      	at org.junit.Assert.fail(Assert.java:71)
      	at org.junit.Assert.failNotEquals(Assert.java:451)
      	at org.junit.Assert.assertEquals(Assert.java:99)
      	at org.junit.Assert.assertEquals(Assert.java:116)
      	at org.glassfish.orb.admin.cli.ListIiopListenersTest.testExecuteSuccessListNoListener(ListIiopListenersTest.java:160)
      	at sun.reflect.NativeMethodAccessorImpl.invoke0(Native Method)
      	at sun.reflect.NativeMethodAccessorImpl.invoke(NativeMethodAccessorImpl.java:57)
      	at sun.reflect.DelegatingMethodAccessorImpl.invoke(DelegatingMethodAccessorImpl.java:43)
      	at java.lang.reflect.Method.invoke(Method.java:601)
      	at org.junit.internal.runners.TestMethodRunner.executeMethodBody(TestMethodRunner.java:99)
      	at org.junit.internal.runners.TestMethodRunner.runUnprotected(TestMethodRunner.java:81)
      	at org.junit.internal.runners.BeforeAndAfterRunner.runProtected(BeforeAndAfterRunner.java:34)
      	at org.junit.internal.runners.TestMethodRunner.runMethod(TestMethodRunner.java:75)
      	at org.junit.internal.runners.TestMethodRunner.run(TestMethodRunner.java:45)
      	at org.junit.internal.runners.TestClassMethodsRunner.invokeTestMethod(TestClassMethodsRunner.java:66)
      	at org.junit.internal.runners.TestClassMethodsRunner.run(TestClassMethodsRunner.java:35)
      	at org.junit.internal.runners.TestClassRunner$1.runUnprotected(TestClassRunner.java:42)
      	at org.junit.internal.runners.BeforeAndAfterRunner.runProtected(BeforeAndAfterRunner.java:34)
      	at org.junit.internal.runners.TestClassRunner.run(TestClassRunner.java:52)
      	at org.apache.maven.surefire.junit4.JUnit4TestSet.execute(JUnit4TestSet.java:62)
      	at org.apache.maven.surefire.suite.AbstractDirectoryTestSuite.executeTestSet(AbstractDirectoryTestSuite.java:140)
      	at org.apache.maven.surefire.suite.AbstractDirectoryTestSuite.execute(AbstractDirectoryTestSuite.java:127)
      	at org.apache.maven.surefire.Surefire.run(Surefire.java:177)
      	at sun.reflect.NativeMethodAccessorImpl.invoke0(Native Method)
      	at sun.reflect.NativeMethodAccessorImpl.invoke(NativeMethodAccessorImpl.java:57)
      	at sun.reflect.DelegatingMethodAccessorImpl.invoke(DelegatingMethodAccessorImpl.java:43)
      	at java.lang.reflect.Method.invoke(Method.java:601)
      	at org.apache.maven.surefire.booter.SurefireBooter.runSuitesInProcess(SurefireBooter.java:345)
      	at org.apache.maven.surefire.booter.SurefireBooter.run(SurefireBooter.java:241)
      	at org.apache.maven.plugin.surefire.SurefirePlugin.execute(SurefirePlugin.java:537)
      	at org.apache.maven.plugin.DefaultPluginManager.executeMojo(DefaultPluginManager.java:490)
      	at org.apache.maven.lifecycle.DefaultLifecycleExecutor.executeGoals(DefaultLifecycleExecutor.java:694)
      	at org.apache.maven.lifecycle.DefaultLifecycleExecutor.executeGoalWithLifecycle(DefaultLifecycleExecutor.java:556)
      	at org.apache.maven.lifecycle.DefaultLifecycleExecutor.executeGoal(DefaultLifecycleExecutor.java:535)
      	at org.apache.maven.lifecycle.DefaultLifecycleExecutor.executeGoalAndHandleFailures(DefaultLifecycleExecutor.java:387)
      	at org.apache.maven.lifecycle.DefaultLifecycleExecutor.executeTaskSegments(DefaultLifecycleExecutor.java:348)
      	at org.apache.maven.lifecycle.DefaultLifecycleExecutor.execute(DefaultLifecycleExecutor.java:180)
      	at org.apache.maven.DefaultMaven.doExecute(DefaultMaven.java:328)
      	at org.apache.maven.DefaultMaven.execute(DefaultMaven.java:138)
      	at org.apache.maven.cli.MavenCli.main(MavenCli.java:362)
      	at org.apache.maven.cli.compat.CompatibleMain.main(CompatibleMain.java:60)
      	at sun.reflect.NativeMethodAccessorImpl.invoke0(Native Method)
      	at sun.reflect.NativeMethodAccessorImpl.invoke(NativeMethodAccessorImpl.java:57)
      	at sun.reflect.DelegatingMethodAccessorImpl.invoke(DelegatingMethodAccessorImpl.java:43)
      	at java.lang.reflect.Method.invoke(Method.java:601)
      	at org.codehaus.classworlds.Launcher.launchEnhanced(Launcher.java:315)
      	at org.codehaus.classworlds.Launcher.launch(Launcher.java:255)
      	at org.codehaus.classworlds.Launcher.mainWithExitCode(Launcher.java:430)
      	at org.codehaus.classworlds.Launcher.main(Launcher.java:375)
      
      -------------------------------------------------------------------------------
      Test set: org.glassfish.orb.admin.cli.TestDocument
      -------------------------------------------------------------------------------
      Tests run: 1, Failures: 0, Errors: 0, Skipped: 1, Time elapsed: 0.001 sec
      

        Activity

        Hide
        Romain Grécourt added a comment -

        As the issue can be only seen when building from top level directory (which can be very long), you may want to use the following steps:

        $ cd [glassfishWorkspace]/appserver/connectors/admin
        $ mvn -Dtest=org.glassfish.orb.admin.cli.ListIiopListenersTest#testExecuteSuccessListNoListener org.apache.maven.plugins:maven-surefire-plugin:2.8:test
        

        You must use a version of the surefire plugin greater or equals to 2.7.3. For more information see this link

        Show
        Romain Grécourt added a comment - As the issue can be only seen when building from top level directory (which can be very long), you may want to use the following steps: $ cd [glassfishWorkspace]/appserver/connectors/admin $ mvn -Dtest=org.glassfish.orb.admin.cli.ListIiopListenersTest#testExecuteSuccessListNoListener org.apache.maven.plugins:maven-surefire-plugin:2.8:test You must use a version of the surefire plugin greater or equals to 2.7.3. For more information see this link
        Hide
        Harshad Vilekar added a comment -

        Fixed, revision # 52611

        Following tests at main/appserver/orb/orb-connector PASS with JDK7, JDK6.
        test=org.glassfish.orb.admin.cli.ListIiopListenersTest#testExecuteSuccessListNoListener
        test=org.glassfish.orb.admin.cli.ListIiopListenersTest#testExecuteSuccessListListener
        test=org.glassfish.orb.admin.cli.ListIiopListenersTest#testExecuteSuccessValidTargetOperand
        test=org.glassfish.orb.admin.cli.ListIiopListenersTest#testExecuteSuccessListOriginal

        Clean build at [glassfishWorkspace]/main/appserver/orb directory PASS with JDK7, JDK6.
        Build at top level directory [glassfishWorkspace]/main/appserver pass with JDK6.

        Show
        Harshad Vilekar added a comment - Fixed, revision # 52611 Following tests at main/appserver/orb/orb-connector PASS with JDK7, JDK6. test=org.glassfish.orb.admin.cli.ListIiopListenersTest#testExecuteSuccessListNoListener test=org.glassfish.orb.admin.cli.ListIiopListenersTest#testExecuteSuccessListListener test=org.glassfish.orb.admin.cli.ListIiopListenersTest#testExecuteSuccessValidTargetOperand test=org.glassfish.orb.admin.cli.ListIiopListenersTest#testExecuteSuccessListOriginal Clean build at [glassfishWorkspace] /main/appserver/orb directory PASS with JDK7, JDK6. Build at top level directory [glassfishWorkspace] /main/appserver pass with JDK6.

          People

          • Assignee:
            Harshad Vilekar
            Reporter:
            Romain Grécourt
          • Votes:
            0 Vote for this issue
            Watchers:
            0 Start watching this issue

            Dates

            • Created:
              Updated:
              Resolved: