glassfish
  1. glassfish
  2. GLASSFISH-20079

Integration EE test failures in 1.1.0.CR4 TCK

    Details

    • Type: Bug Bug
    • Status: Closed
    • Priority: Major Major
    • Resolution: Fixed
    • Affects Version/s: None
    • Fix Version/s: 4.0_b86_RC2
    • Component/s: bean-validator
    • Labels:
      None

      Description

      testJndiBoundValidatorFactoryIsCdiEnabled(org.hibernate.beanvalidation.tck.tests.integration.ee.cdi.ConstraintValidatorInjectionTest) Time elapsed: 0.623 sec <<< FAILURE!
      testDefaultValidatorCanBeRetrievedFromJndi(org.hibernate.beanvalidation.tck.tests.integration.ee.JndiRetrievalTest) Time elapsed: 0.645 sec <<< FAILURE!
      testDefaultValidatorFactoryCanBeRetrievedFromJndi(org.hibernate.beanvalidation.tck.tests.integration.ee.JndiRetrievalTest) Time elapsed: 0.025 sec <<< FAILURE!

        Activity

        There are no comments yet on this issue.

          People

          • Assignee:
            mtaube
            Reporter:
            mtaube
          • Votes:
            0 Vote for this issue
            Watchers:
            0 Start watching this issue

            Dates

            • Created:
              Updated:
              Resolved: