thucydides
  1. thucydides
  2. THUCYDIDES-136

jBehave Maven archetype / Build Failure

    Details

    • Type: Bug Bug
    • Status: Resolved
    • Priority: Minor Minor
    • Resolution: Fixed
    • Affects Version/s: None
    • Fix Version/s: None
    • Labels:
      None
    • Environment:

      Windows 7
      Thucydides 0.9.95

      Description

      Hi,

      I used the following link to jumpstart a Thucydides jBehave project

      http://thucydides-webtests.com/2012/12/19/thucydides-release-0-9-88-jbehave-archetype-improved-jbehave-integration-and-other-enhancements/

      mvn archetype:generate -DarchetypeGroupId=net.thucydides -DarchetypeArtifactId=thucydides-jbehave-archetype -DgroupId=com.testing.app -DartifactId=SampleJBehaveProject

      The project was successful created.

      mvn integration-test

      ... but build failed.

      [INFO] ------------------------------------------------------------------------
      [INFO] BUILD FAILURE
      [INFO] ------------------------------------------------------------------------
      [INFO] Total time: 4.482s
      [INFO] Finished at: Tue Feb 12 16:16:07 EST 2013
      [INFO] Final Memory: 19M/159M
      [INFO] ------------------------------------------------------------------------
      [ERROR] Failed to execute goal org.apache.maven.plugins:maven-compiler-plugin:2.
      3.2:compile (default-compile) on project SampleJBehaveProject: Compilation failu
      re
      [ERROR] \workspace\sts_3.1_testing\SampleJBehaveProject\src\main\java\com\testin
      g\app\steps\EndUserSteps.java:[34,8] error: no suitable method found for assertT
      hat(List,Matcher<Iterable<? super String>>)

        Activity

        Hide
        johnsmart added a comment -

        This is to do with Hamcrest 1.3 and generics - I will take a look.

        Show
        johnsmart added a comment - This is to do with Hamcrest 1.3 and generics - I will take a look.
        Hide
        johnsmart added a comment -

        Fixed in version 0.9.100 of the archetypes

        Show
        johnsmart added a comment - Fixed in version 0.9.100 of the archetypes

          People

          • Assignee:
            johnsmart
            Reporter:
            soros
          • Votes:
            0 Vote for this issue
            Watchers:
            0 Start watching this issue

            Dates

            • Created:
              Updated:
              Resolved: