[GLASSFISH-15444] Dev test failures Created: 05/Jan/11  Updated: 06/Mar/12  Due: 14/Jan/11

Status: Open
Project: glassfish
Component/s: admin_gui
Affects Version/s: 3.1
Fix Version/s: not determined

Type: Bug Priority: Minor
Reporter: Nazrul Assignee: Jason Lee
Resolution: Unresolved Votes: 0
Labels: None
Remaining Estimate: Not Specified
Time Spent: Not Specified
Original Estimate: Not Specified

Issue Links:
Dependency
depends on GLASSFISH-15547 Dev Test Failure(s) Resolved
depends on GLASSFISH-15549 Dev Test Failure(s) Resolved
depends on GLASSFISH-15548 Dev Test Failure(s) Closed
Tags: 3-1-exclude

 Description   

[Tracking Bug]

We need to get console Dev Tests working. I am filing this bug to track this. Please close it only when all GUI Dev Tests are passing. We plan to leverage these Dev Tests during final system testing to certify different supported OS and browser matrix.

Here is the latest status from today:

[artifact:mvn] -------------------------------------------------------
[artifact:mvn] T E S T S
[artifact:mvn] -------------------------------------------------------
[artifact:mvn] Running org.glassfish.admingui.devtests.TransactionServiceTest

[artifact:mvn] Tests run: 1, Failures: 1, Errors: 0, Skipped: 0, Time elapsed: 146.721 sec <<< FAILURE!
[artifact:mvn] Running org.glassfish.admingui.devtests.ConnectorsTest

[artifact:mvn] Tests run: 3, Failures: 0, Errors: 1, Skipped: 0, Time elapsed: 47.524 sec <<< FAILURE!
[artifact:mvn] Running org.glassfish.admingui.devtests.ConnectorServiceTest

[artifact:mvn] Tests run: 1, Failures: 0, Errors: 0, Skipped: 0, Time elapsed: 10.328 sec
[artifact:mvn] Running org.glassfish.admingui.devtests.ConfigTest

[artifact:mvn] Tests run: 1, Failures: 0, Errors: 0, Skipped: 0, Time elapsed: 12.1 sec
[artifact:mvn] Running org.glassfish.admingui.devtests.VirtualServerTest

[artifact:mvn] Tests run: 1, Failures: 0, Errors: 1, Skipped: 0, Time elapsed: 8.764 sec <<< FAILURE!
[artifact:mvn] Running org.glassfish.admingui.devtests.LifecycleModulesTest

[artifact:mvn] Tests run: 1, Failures: 0, Errors: 1, Skipped: 0, Time elapsed: 7.567 sec <<< FAILURE!
[artifact:mvn] Running org.glassfish.admingui.devtests.JavaMessageServiceTest

[artifact:mvn] Tests run: 3, Failures: 0, Errors: 1, Skipped: 0, Time elapsed: 21.177 sec <<< FAILURE!
[artifact:mvn] Running org.glassfish.admingui.devtests.ResourceAdapterConfigsTest

[artifact:mvn] Tests run: 1, Failures: 0, Errors: 0, Skipped: 0, Time elapsed: 14.448 sec
[artifact:mvn] Running org.glassfish.admingui.devtests.SecurityTest

[artifact:mvn] Tests run: 6, Failures: 1, Errors: 1, Skipped: 0, Time elapsed: 851.604 sec <<< FAILURE!
[artifact:mvn] Running org.glassfish.admingui.devtests.JVMReportTest

[artifact:mvn] Tests run: 1, Failures: 0, Errors: 0, Skipped: 0, Time elapsed: 7.61 sec
[artifact:mvn] Running org.glassfish.admingui.devtests.JdbcTest

[artifact:mvn] Tests run: 4, Failures: 0, Errors: 1, Skipped: 0, Time elapsed: 35.354 sec <<< FAILURE!
[artifact:mvn] Running org.glassfish.admingui.devtests.LoggerSettingsTest

[artifact:mvn] Tests run: 2, Failures: 0, Errors: 0, Skipped: 0, Time elapsed: 16.116 sec
[artifact:mvn] Running org.glassfish.admingui.devtests.JvmSettingsTest

[artifact:mvn] Tests run: 3, Failures: 0, Errors: 0, Skipped: 0, Time elapsed: 19.002 sec
[artifact:mvn] Running org.glassfish.admingui.devtests.AdminServiceTest

[artifact:mvn] Tests run: 2, Failures: 0, Errors: 1, Skipped: 0, Time elapsed: 13.248 sec <<< FAILURE!
[artifact:mvn] Running org.glassfish.admingui.devtests.JndiTest

[artifact:mvn] Tests run: 4, Failures: 0, Errors: 2, Skipped: 0, Time elapsed: 36.473 sec <<< FAILURE!
[artifact:mvn] Running org.glassfish.admingui.devtests.JmsResourcesTest

[artifact:mvn] Tests run: 4, Failures: 0, Errors: 2, Skipped: 0, Time elapsed: 29.295 sec <<< FAILURE!
[artifact:mvn] Running org.glassfish.admingui.devtests.GMSTest

[artifact:mvn] Tests run: 1, Failures: 0, Errors: 0, Skipped: 0, Time elapsed: 11.942 sec
[artifact:mvn] Running org.glassfish.admingui.devtests.NodeTest

[artifact:mvn] Tests run: 3, Failures: 3, Errors: 0, Skipped: 0, Time elapsed: 345.99 sec <<< FAILURE!
[artifact:mvn] Running org.glassfish.admingui.devtests.ClusterTest

[artifact:mvn] Tests run: 1, Failures: 0, Errors: 0, Skipped: 0, Time elapsed: 63.381 sec
[artifact:mvn] Running org.glassfish.admingui.devtests.StandaloneTest

[artifact:mvn] Tests run: 3, Failures: 0, Errors: 3, Skipped: 0, Time elapsed: 13.533 sec <<< FAILURE!
[artifact:mvn] Running org.glassfish.admingui.devtests.WorkSecurityMapTest

[artifact:mvn] Tests run: 1, Failures: 0, Errors: 0, Skipped: 0, Time elapsed: 13.526 sec
[artifact:mvn] Running org.glassfish.admingui.devtests.RestResponseTest

[artifact:mvn] Tests run: 3, Failures: 0, Errors: 3, Skipped: 0, Time elapsed: 3.457 sec <<< FAILURE!
[artifact:mvn] Running org.glassfish.admingui.devtests.EnterpriseServerTest

[artifact:mvn] Tests run: 3, Failures: 0, Errors: 1, Skipped: 0, Time elapsed: 21.807 sec <<< FAILURE!
[artifact:mvn] Running org.glassfish.admingui.devtests.HttpServiceTest

[artifact:mvn] Tests run: 1, Failures: 1, Errors: 0, Skipped: 0, Time elapsed: 124.764 sec <<< FAILURE!
[artifact:mvn] Running org.glassfish.admingui.devtests.AvailabilityServiceTest

[artifact:mvn] Tests run: 4, Failures: 4, Errors: 0, Skipped: 0, Time elapsed: 463.54 sec <<< FAILURE!
[artifact:mvn] Running org.glassfish.admingui.devtests.ApplicationTest

[artifact:mvn] Tests run: 3, Failures: 1, Errors: 0, Skipped: 0, Time elapsed: 83.179 sec <<< FAILURE!
[artifact:mvn] Running org.glassfish.admingui.devtests.JavaMailTest

[artifact:mvn] Tests run: 2, Failures: 0, Errors: 1, Skipped: 0, Time elapsed: 24.111 sec <<< FAILURE!
[artifact:mvn] Running org.glassfish.admingui.devtests.IiopListenerTest

[artifact:mvn] Tests run: 2, Failures: 0, Errors: 0, Skipped: 0, Time elapsed: 17.501 sec
[artifact:mvn] Running org.glassfish.admingui.devtests.EjbContainerTest

[artifact:mvn] Tests run: 4, Failures: 0, Errors: 0, Skipped: 0, Time elapsed: 28.841 sec
[artifact:mvn] Running org.glassfish.admingui.devtests.MonitoringTest

[artifact:mvn] Tests run: 3, Failures: 1, Errors: 1, Skipped: 0, Time elapsed: 159.509 sec <<< FAILURE!
[artifact:mvn] Running org.glassfish.admingui.devtests.WebContainerTest

[artifact:mvn] Tests run: 4, Failures: 0, Errors: 0, Skipped: 0, Time elapsed: 26.753 sec
[artifact:mvn] Running org.glassfish.admingui.devtests.AdminObjectTest

[artifact:mvn] Tests run: 2, Failures: 1, Errors: 1, Skipped: 0, Time elapsed: 16.684 sec <<< FAILURE!
[artifact:mvn] Running org.glassfish.admingui.devtests.JsonUtilTest
[artifact:mvn] Tests run: 6, Failures: 0, Errors: 0, Skipped: 0, Time elapsed: 0.021 sec
[artifact:mvn] Running org.glassfish.admingui.devtests.ThreadPoolsTest

[artifact:mvn] Tests run: 1, Failures: 0, Errors: 0, Skipped: 0, Time elapsed: 13.466 sec
[artifact:mvn] Running org.glassfish.admingui.devtests.NetworkConfigTest

[artifact:mvn] Tests run: 3, Failures: 0, Errors: 0, Skipped: 0, Time elapsed: 28.57 sec
[artifact:mvn]
[artifact:mvn] Results :
[artifact:mvn]
[artifact:mvn] Failed tests:
[artifact:mvn] testTransactionService(org.glassfish.admingui.devtests.TransactionServiceTest)
[artifact:mvn] testAddMessageSecurityConfiguration(org.glassfish.admingui.devtests.SecurityTest)
[artifact:mvn] testCreateAndDeleteNode(org.glassfish.admingui.devtests.NodeTest)
[artifact:mvn] testUpdateNode(org.glassfish.admingui.devtests.NodeTest)
[artifact:mvn] testDeleteWithInstance(org.glassfish.admingui.devtests.NodeTest)
[artifact:mvn] testHttpService(org.glassfish.admingui.devtests.HttpServiceTest)
[artifact:mvn] testAvailabilityService(org.glassfish.admingui.devtests.AvailabilityServiceTest)
[artifact:mvn] testWebContainerAvailability(org.glassfish.admingui.devtests.AvailabilityServiceTest)
[artifact:mvn] testEjbContainerAvailability(org.glassfish.admingui.devtests.AvailabilityServiceTest)
[artifact:mvn] testJMSAvailability(org.glassfish.admingui.devtests.AvailabilityServiceTest)
[artifact:mvn] testDeployWar(org.glassfish.admingui.devtests.ApplicationTest)
[artifact:mvn] testMonitoringApplicationsPage(org.glassfish.admingui.devtests.MonitoringTest)
[artifact:mvn] testAdminObjectResources(org.glassfish.admingui.devtests.AdminObjectTest)
[artifact:mvn]
[artifact:mvn] Tests in error:
[artifact:mvn] testConnectorResourcesWithTargets(org.glassfish.admingui.devtests.ConnectorsTest)
[artifact:mvn] testAddVirtualServer(org.glassfish.admingui.devtests.VirtualServerTest)
[artifact:mvn] testLifecycleModules(org.glassfish.admingui.devtests.LifecycleModulesTest)
[artifact:mvn] testJmsPhysicalDestinations(org.glassfish.admingui.devtests.JavaMessageServiceTest)
[artifact:mvn] testSecurityPage(org.glassfish.admingui.devtests.SecurityTest)
[artifact:mvn] testJdbcResourcesWithTargets(org.glassfish.admingui.devtests.JdbcTest)
[artifact:mvn] testEditJmxConntector(org.glassfish.admingui.devtests.AdminServiceTest)
[artifact:mvn] testCustomResourcesWithTargets(org.glassfish.admingui.devtests.JndiTest)
[artifact:mvn] testExternalResourcesWithTargets(org.glassfish.admingui.devtests.JndiTest)
[artifact:mvn] testAddingConnectionFactoriesWithTargets(org.glassfish.admingui.devtests.JmsResourcesTest)
[artifact:mvn] testAddingDestinationResourcesWithTargets(org.glassfish.admingui.devtests.JmsResourcesTest)
[artifact:mvn] testProperties(org.glassfish.admingui.devtests.StandaloneTest)
[artifact:mvn] testCreateAndDeleteStandaloneInstance(org.glassfish.admingui.devtests.StandaloneTest)
[artifact:mvn] testStandaloneInstanceResourcesPage(org.glassfish.admingui.devtests.StandaloneTest)
[artifact:mvn] testPostCommand(org.glassfish.admingui.devtests.RestResponseTest)
[artifact:mvn] testGetCommand(org.glassfish.admingui.devtests.RestResponseTest)
[artifact:mvn] testEndpointExists(org.glassfish.admingui.devtests.RestResponseTest)
[artifact:mvn] testSystemProperties(org.glassfish.admingui.devtests.EnterpriseServerTest)
[artifact:mvn] createMailResourceWithTargets(org.glassfish.admingui.devtests.JavaMailTest)
[artifact:mvn] testMonitoringServerPage(org.glassfish.admingui.devtests.MonitoringTest)
[artifact:mvn] testAdminObjectResourcesWithTargets(org.glassfish.admingui.devtests.AdminObjectTest)
[artifact:mvn]
[artifact:mvn] Tests run: 88, Failures: 13, Errors: 21, Skipped: 0
[artifact:mvn]
[artifact:mvn] [INFO] ------------------------------------------------------------------------
[artifact:mvn] [ERROR] BUILD FAILURE
[artifact:mvn] [INFO] ------------------------------------------------------------------------
[artifact:mvn] [INFO] There are test failures.
[artifact:mvn]
[artifact:mvn] Please refer to c:\hudson\workspace\v3-admingui-devtests\devtests\target\surefire-reports for the individual test results.
[artifact:mvn] [INFO] ------------------------------------------------------------------------
[artifact:mvn] [INFO] For more information, run Maven with the -e switch
[artifact:mvn] [INFO] ------------------------------------------------------------------------
[artifact:mvn] [INFO] Total time: 46 minutes 1 second
[artifact:mvn] [INFO] Finished at: Wed Jan 05 09:11:40 CST 2011
[artifact:mvn] [INFO] Final Memory: 22M/94M
[artifact:mvn] [INFO] ------------------------------------------------------------------------
[artifact:mvn] Java Result: 1



 Comments   
Comment by Nazrul [ 05/Jan/11 ]

Adding 3_1-review to exclude from un-scrubbed list

Comment by Tom Mueller [ 06/Mar/12 ]

Bulk update to change fix version to "not determined" for all issues still open but with a fix version for a released version.

Generated at Sun Dec 11 01:58:38 UTC 2016 using JIRA 6.2.3#6260-sha1:63ef1d6dac3f4f4d7db4c1effd405ba38ccdc558.