Java.net JIRA

40-regression
Key descending
135 of 35 as at: 24/Jan/17 7:30 AM
T Key Summary Assignee Reporter P Status Resolution Created Updated Due
Bug GLASSFISH-20812

java.lang.IllegalArgumentException when configurate the connector security map

Anissa Lam Jeremy_Lv Major Open Unresolved  
Bug GLASSFISH-20810

NPE will be thrown to the server.log when save the default value of Availability Service page

Jason Lee Jeremy_Lv Critical Resolved Fixed  
Bug GLASSFISH-20789

Failed to create cluster with jms option

Anissa Lam Jeremy_Lv Major Resolved Fixed  
Bug GLASSFISH-20184

[Regression] SDK 4.0 - Websocket sample (auction) fails to build

Pavel Bucek Alex Pineda Major Resolved Fixed  
Bug GLASSFISH-20138

[Regression] asadmin create-profiler and delete-profiler fails in build 82

Tom Mueller Alex Pineda Major Resolved Fixed  
Bug GLASSFISH-19670

Unable to create domain after removing default domain and directory

Alok Jain Alex Pineda Blocker Resolved Fixed  
Bug GLASSFISH-19450

12 moxy test failures on b67

Jakub Podlesak sherryshen Critical Resolved Fixed  
Bug GLASSFISH-19445

[Regression] Creation of JMS resources fails

David Zhao Alex Pineda Critical Resolved Works as designed  
Bug GLASSFISH-19304

JAXRS failure with Default JAXBContext

Jakub Podlesak sherryshen Critical Resolved Fixed  
Bug GLASSFISH-19255

Error in formatting Logrecord in jpa tests

sandeep.shrivastava sherryshen Critical Resolved Fixed  
Bug GLASSFISH-19151

no version on glassfish-4.0-b57.zip

Snjezana Sevo-Zenzerovic sherryshen Major Resolved Fixed  
Bug GLASSFISH-19090

create-jdbc-resource failure when resource name same as connectionpoolid

Tom Mueller sherryshen Major Resolved Invalid  
Bug GLASSFISH-19018

tx recovery tests failed due to ClassCastException: initRecovery

marina vatkina sherryshen Critical Resolved Fixed  
Bug GLASSFISH-19015

set server-config.transaction-service.timeout-in-seconds

sherryshen sherryshen Major Resolved Fixed  
Bug GLASSFISH-19014

jpa coherence tests failed due to ClassCastException: TransactionServiceProperties.initRecovery

Mitesh Meswani sherryshen Critical Resolved Fixed  
Bug GLASSFISH-18952

[regression] web test failed with empty contextpath specified in sun-web.xml

Shing Wai Chan sherryshen Major Closed Duplicate  
Bug GLASSFISH-18951

JAXBRI of PUT/POST failures with Default JAXBContext

Jakub Podlesak sherryshen Major Resolved Fixed  
Bug GLASSFISH-18927

failed to start a cluster with password

Tom Mueller sherryshen Major Resolved Fixed  
Bug GLASSFISH-18879

[regression] session size test failed in FailoverRuntime34

Ryan Lubke sherryshen Major Resolved Fixed  
Bug GLASSFISH-18858

After the execution of versioning timer apps deployment, next timer apps deployment - failed.

marina vatkina aelena Major Resolved Fixed  
Bug GLASSFISH-18857

"deploy --target my-c1 --name=timersession:1.0 --retrieve timersession.ear" created a wrong syntax error

Hong Zhang aelena Major Resolved Fixed  
Bug GLASSFISH-18855

4.0 b43, the deployment of several apps failed: com.sun.jersey.spi.container.servlet.ServletContainer - not found.

Jakub Podlesak aelena Major Resolved Invalid  
Bug GLASSFISH-18813

JAXBRI of GET failure with Default JAXBContext

Jakub Podlesak sherryshen Major Resolved Fixed  
Bug GLASSFISH-18811

ClassNotFoundException: com.sun.jersey.spi.container.servlet.ServletContainer

Jakub Podlesak sherryshen Major Resolved Fixed  
Bug GLASSFISH-18786

Server port is shutting down for HttpListners after running the create-http-listner followed by delete-http-listner

Amy Roh Arundhati Major Closed Invalid  
Bug GLASSFISH-18778

[REGRESSION]create-jmsdes command failed in cluster mode

sonialiu sonialiu Critical Resolved Fixed  
Bug GLASSFISH-18770

[regression] DTX5016:Error in XA recovery with NPE in loadXAResourcesAndItsConnections

Masoud Kalali sherryshen Critical Resolved Fixed  
Bug GLASSFISH-18756

[kvm] [ovm] create ims config for kvm and ovm fails with premature end of file

Bhakti Mehta shariffking Critical Resolved Fixed  
Bug GLASSFISH-18738

[REGRESSION][BLOCKING] Appclient command failed in wss security test against b37

Tim Quinn sonialiu Critical Resolved Fixed  
Bug GLASSFISH-18736

[regression] could not locate or convert a java type (null)

tware sherryshen Major Resolved Fixed  
Bug GLASSFISH-18716

[Regression] Unable to login to Admin Console

Jason Lee Alex Pineda Major Resolved Fixed  
Bug GLASSFISH-18677

[NATIVE] [OEL6] LB (50080) is not working - "The webpage cannot be found " [basic_db_paas_sample]

kshitiz_saxena RameshT Major Closed Duplicate  
Bug GLASSFISH-18660

[regression] jpql fetchjoin_1x1 failure

Mitesh Meswani sherryshen Major Resolved Fixed  
Bug GLASSFISH-18658

[regression] jpql failed to update enum

tware sherryshen Major Resolved Fixed  
Bug GLASSFISH-18586

[NATIVE][OEL5 & SUSE] LB library is not available [libexpat.so.1 => not found] [basic_db_paas_sample]

kshitiz_saxena RameshT Major Resolved Fixed