Skip to main content
This revision made September 14, 2011 12:38, by ronaldtoegl

TCK Result Collection

  	

Fully compatible TPMs

HP Elitebook 8440p


JSR321 TECHNOLOGY COMPATIBILITY KIT
JUnit version 4.9b3
Reading TrustedComputingSuite test configuration from system property jsr321.tck.abstracttestcaseconfig..OK.
.
*** JSR321 TCK Test Suite Configuration Information***
tpmContextImplementation: iaik.tc.jsr321.tpm.TPMContextImpl
tpmContextConnectionURL: null
aikKeyUUID: 0a9cbfe2-f2e1-4be6-9266-57e920fda614

*** JSR321 TCK Version Information***
TPM Manufacturer: IFX
TPM Version: 1.2
TPM Firmware Version: 3.17
TSS Vendor: IAIK
TSS Version: Version: 1.2.0.7
JSR321 Specification Revision: 11.09
JSR321 Implementation Version: 1.0

*** JSR321 TCK System Information***
Operating System: Linux
System Architecture: i386
Operating System Version: 2.6.38-11-generic-pae
Java Vendor: Sun Microsystems Inc.
Java Version: 1.6.0_22
Classpath: /home/rtoegl/jsr321/jsr321-tck/lib/junit.jar:/home/rtoegl/jsr321/jsr321-tck/lib/asm-all.jar:/home/rtoegl/jsr321/jsr321-tck/jsr321-tck-utils.jar:/home/rtoegl/jsr321/jsr321-tck/../jsr321-ri/jsr321-ri.jar:/usr/share/jtss/ext_libs/hsqldbmin.jar:/usr/share/jtss/ext_libs/xerces.jar:/usr/share/jtss/ext_libs/wsdl4j-1.5.1.jar:/usr/share/jtss/ext_libs/saaj.jar:/usr/share/jtss/ext_libs/mail.jar:/usr/share/jtss/ext_libs/log4j-1.2.8.jar:/usr/share/jtss/ext_libs/jaxrpc.jar:/usr/share/jtss/ext_libs/commons-logging-1.0.4.jar:/usr/share/jtss/ext_libs/commons-discovery-0.2.jar:/usr/share/jtss/ext_libs/commons-daemon.jar:/usr/share/jtss/ext_libs/axis.jar:/usr/share/jtss/ext_libs/axis-ant.jar:/usr/share/jtss/ext_libs/activation.jar:/usr/share/jtss/lib/iaik_jtss_tsp_soap.jar:/usr/share/jtss/lib/iaik_jtss_tsp.jar:/home/rtoegl/jsr321/jsr321-tck/../jsr321-api/jsr321.jar:/home/rtoegl/jsr321/jsr321-tck/classes/

.............................................................................................
Time: 1,919.453

OK (94 tests)


HP dc7900


  ------------
   JSR321 TCK
  ------------
JUnit version 4.9b3
Reading TrustedComputingSuite test configuration from system property jsr321.tck
.abstracttestcaseconfig..OK.
.
*** JSR321 TCK Test Suite Configuration Information***
tpmContextImplementation: iaik.tc.jsr321.tpm.TPMContextImpl
tpmContextConnectionURL: null
aikKeyUUID: 116649ac-e15e-4d83-b01a-8c37e6319f8b

*** JSR321 TCK Version Information***
TPM Manufacturer: IFX
TPM Version: 1.2
TPM Firmware Version: 3.17
TSS Vendor: IAIK
TSS Version: Version: 1.2.0.7
JSR321 Specification Revision: 11.09
JSR321 Implementation Version: 1.0

*** JSR321 TCK System Information***
Operating System: Windows 7
System Architecture: x86
Operating System Version: 6.1
Java Vendor: Sun Microsystems Inc.
Java Version: 1.6.0_26
Classpath: C:\Program Files\jTSS\lib\iaik_jtss_tcs.jar;C:\Program Files\jTSS\lib
\iaik_jtss_tcs_soap.jar;C:\Program Files\jTSS\lib\iaik_jtss_tsp.jar;C:\Program F
iles\jTSS\lib\iaik_jtss_tsp_soap.jar;C:\Program Files\jTSS\ext_libs\hsqldbmin.ja
r;C:\Program Files\jTSS\ext_libs\activation.jar;C:\Program Files\jTSS\ext_libs\a
xis-ant.jar;C:\Program Files\jTSS\ext_libs\axis.jar;C:\Program Files\jTSS\ext_li
bs\commons-daemon.jar;C:\Program Files\jTSS\ext_libs\commons-discovery-0.2.jar;C
:\Program Files\jTSS\ext_libs\commons-logging-1.0.4.jar;C:\Program Files\jTSS\ex
t_libs\jaxrpc.jar;C:\Program Files\jTSS\ext_libs\log4j-1.2.8.jar;C:\Program File
s\jTSS\ext_libs\mail.jar;C:\Program Files\jTSS\ext_libs\saaj.jar;C:\Program File
s\jTSS\ext_libs\wsdl4j-1.5.1.jar;C:\Program Files\jTSS\ext_libs\xerces.jar;C:\js
r321\JSR321~3\lib\junit.jar;C:\jsr321\JSR321~3\lib\asm-all.jar;C:\jsr321\JSR321~
3\jsr321-tck-utils.jar;C:\jsr321\JSR321~3\..\jsr321-api\jsr321.jar;C:\jsr321\JSR
321~3\..\jsr321-ri\jsr321-ri.jar;C:\jsr321\JSR321~3\classes\

................................................................................
.............
Time: 1.751,337

OK (94 tests)


Lenovo T61p with SW TPM

  ------------
   JSR321 TCK
  ------------
JUnit version 4.9b3
Reading TrustedComputingSuite test configuration from system property jsr321.tck
.abstracttestcaseconfig..OK.
.
*** JSR321 TCK Test Suite Configuration Information***
tpmContextImplementation: iaik.tc.jsr321.tpm.TPMContextImpl
tpmContextConnectionURL: null
aikKeyUUID: 994f1d1a-f28e-4c52-ab51-877ebf6d2d7e

*** JSR321 TCK Version Information***
TPM Manufacturer: IBM
TPM Version: 1.2
TPM Firmware Version: 15.236
TSS Vendor: IAIK
TSS Version: Version: 1.2.0.7
JSR321 Specification Revision: 11.09
JSR321 Implementation Version: 1.0

*** JSR321 TCK System Information***
Operating System: Windows 7
System Architecture: amd64
Operating System Version: 6.1
Java Vendor: Sun Microsystems Inc.
Java Version: 1.6.0_21
Classpath: C:\Program Files\jTSS\lib\iaik_jtss_tcs.jar;C:\Program Files\jTSS\lib
\iaik_jtss_tcs_soap.jar;C:\Program Files\jTSS\lib\iaik_jtss_tsp.jar;C:\Program F
iles\jTSS\lib\iaik_jtss_tsp_soap.jar;C:\Program Files\jTSS\ext_libs\hsqldbmin.ja
r;C:\Program Files\jTSS\ext_libs\activation.jar;C:\Program Files\jTSS\ext_libs\a
xis-ant.jar;C:\Program Files\jTSS\ext_libs\axis.jar;C:\Program Files\jTSS\ext_li
bs\commons-daemon.jar;C:\Program Files\jTSS\ext_libs\commons-discovery-0.2.jar;C
:\Program Files\jTSS\ext_libs\commons-logging-1.0.4.jar;C:\Program Files\jTSS\ex
t_libs\jaxrpc.jar;C:\Program Files\jTSS\ext_libs\log4j-1.2.8.jar;C:\Program File
s\jTSS\ext_libs\mail.jar;C:\Program Files\jTSS\ext_libs\saaj.jar;C:\Program File
s\jTSS\ext_libs\wsdl4j-1.5.1.jar;C:\Program Files\jTSS\ext_libs\xerces.jar;C:\js
r321\JSR321~1\lib\junit.jar;C:\jsr321\JSR321~1\lib\asm-all.jar;C:\jsr321\JSR321~
1\jsr321-tck-utils.jar;C:\jsr321\JSR321~1\..\jsr321-api\jsr321.jar;C:\jsr321\JSR
321~1\..\jsr321-ri\jsr321-ri.jar;C:\jsr321\JSR321~1\classes\

................................................................................
.............
Time: 417,921

OK (94 tests)

HP Elitebook 8440p

  ------------
   JSR321 TCK
  ------------
JUnit version 4.9b3
Reading TrustedComputingSuite test configuration from system property jsr321.tck
.abstracttestcaseconfig..OK.
.
*** JSR321 TCK Test Suite Configuration Information***
tpmContextImplementation: iaik.tc.jsr321.tpm.TPMContextImpl
tpmContextConnectionURL: null
aikKeyUUID: 481309b3-8538-4cd2-b284-8c2ee7faf6c5

*** JSR321 TCK Version Information***
TPM Manufacturer: IFX
TPM Version: 1.2
TPM Firmware Version: 3.17
TSS Vendor: IAIK
TSS Version: Version: 1.2.0.7
JSR321 Specification Revision: 11.09
JSR321 Implementation Version: 1.0

*** JSR321 TCK System Information***
Operating System: Windows 7
System Architecture: amd64
Operating System Version: 6.1
Java Vendor: Oracle Corporation
Java Version: 1.7.0
Classpath: C:\Program Files\jTSS\lib\iaik_jtss_tcs.jar;C:\Program Files\jTSS\lib
\iaik_jtss_tcs_soap.jar;C:\Program Files\jTSS\lib\iaik_jtss_tsp.jar;C:\Program F
iles\jTSS\lib\iaik_jtss_tsp_soap.jar;C:\Program Files\jTSS\ext_libs\hsqldbmin.ja
r;C:\Program Files\jTSS\ext_libs\activation.jar;C:\Program Files\jTSS\ext_libs\a
xis-ant.jar;C:\Program Files\jTSS\ext_libs\axis.jar;C:\Program Files\jTSS\ext_li
bs\commons-daemon.jar;C:\Program Files\jTSS\ext_libs\commons-discovery-0.2.jar;C
:\Program Files\jTSS\ext_libs\commons-logging-1.0.4.jar;C:\Program Files\jTSS\ex
t_libs\jaxrpc.jar;C:\Program Files\jTSS\ext_libs\log4j-1.2.8.jar;C:\Program File
s\jTSS\ext_libs\mail.jar;C:\Program Files\jTSS\ext_libs\saaj.jar;C:\Program File
s\jTSS\ext_libs\wsdl4j-1.5.1.jar;C:\Program Files\jTSS\ext_libs\xerces.jar;C:\js
r321\JSR321~3\lib\junit.jar;C:\jsr321\JSR321~3\lib\asm-all.jar;C:\jsr321\JSR321~
3\jsr321-tck-utils.jar;C:\jsr321\JSR321~3\..\jsr321-api\jsr321.jar;C:\jsr321\JSR
321~3\..\jsr321-ri\jsr321-ri.jar;C:\jsr321\JSR321~3\classes\

................................................................................
.............
Time: 1.716,43

OK (94 tests)

HP dc7900

  ------------
   JSR321 TCK
  ------------
JUnit version 4.9b3
Reading TrustedComputingSuite test configuration from system property jsr321.tck
.abstracttestcaseconfig..OK.
.
*** JSR321 TCK Test Suite Configuration Information***
tpmContextImplementation: iaik.tc.jsr321.tpm.TPMContextImpl
tpmContextConnectionURL: null
aikKeyUUID: 1072c269-f3f3-4a84-a25f-8c055c51bc18

*** JSR321 TCK Version Information***
TPM Manufacturer: IFX
TPM Version: 1.2
TPM Firmware Version: 3.17
TSS Vendor: IAIK
TSS Version: Version: 1.2.0.7
JSR321 Specification Revision: 11.09
JSR321 Implementation Version: 1.0

*** JSR321 TCK System Information***
Operating System: Windows 7
System Architecture: x86
Operating System Version: 6.1
Java Vendor: Sun Microsystems Inc.
Java Version: 1.5.0_22
Classpath: C:\Program Files\jTSS\lib\iaik_jtss_tcs.jar;C:\Program Files\jTSS\lib
\iaik_jtss_tcs_soap.jar;C:\Program Files\jTSS\lib\iaik_jtss_tsp.jar;C:\Program F
iles\jTSS\lib\iaik_jtss_tsp_soap.jar;C:\Program Files\jTSS\ext_libs\hsqldbmin.ja
r;C:\Program Files\jTSS\ext_libs\activation.jar;C:\Program Files\jTSS\ext_libs\a
xis-ant.jar;C:\Program Files\jTSS\ext_libs\axis.jar;C:\Program Files\jTSS\ext_li
bs\commons-daemon.jar;C:\Program Files\jTSS\ext_libs\commons-discovery-0.2.jar;C
:\Program Files\jTSS\ext_libs\commons-logging-1.0.4.jar;C:\Program Files\jTSS\ex
t_libs\jaxrpc.jar;C:\Program Files\jTSS\ext_libs\log4j-1.2.8.jar;C:\Program File
s\jTSS\ext_libs\mail.jar;C:\Program Files\jTSS\ext_libs\saaj.jar;C:\Program File
s\jTSS\ext_libs\wsdl4j-1.5.1.jar;C:\Program Files\jTSS\ext_libs\xerces.jar;C:\js
r321\JSR321~3\lib\junit.jar;C:\jsr321\JSR321~3\lib\asm-all.jar;C:\jsr321\JSR321~
3\jsr321-tck-utils.jar;C:\jsr321\JSR321~3\..\jsr321-api\jsr321.jar;C:\jsr321\JSR
321~3\..\jsr321-ri\jsr321-ri.jar;C:\jsr321\JSR321~3\classes\

................................................................................
.............
Time: 2.006,906

OK (94 tests)


Partially compatible TPMs

Lenovo X201

Key Certification fails as the STMicroelectronics TPM returns PCR Information structures or hashes thereof that do not match those expected.

  ------------
   JSR321 TCK
  ------------
JUnit version 4.9b3
Reading TrustedComputingSuite test configuration from system property jsr321.tck
.abstracttestcaseconfig..OK.
.
*** JSR321 TCK Test Suite Configuration Information***
tpmContextImplementation: iaik.tc.jsr321.tpm.TPMContextImpl
tpmContextConnectionURL: null
aikKeyUUID: 6d6cd961-56ea-4644-9ac0-621f7b014d9c

*** JSR321 TCK Version Information***
TPM Manufacturer: STM
TPM Version: 1.2
TPM Firmware Version: 8.16
TSS Vendor: IAIK
TSS Version: Version: 1.2.0.7
JSR321 Specification Revision: 11.09
JSR321 Implementation Version: 0.9

*** JSR321 TCK System Information***
Operating System: Windows 7
System Architecture: x86
Operating System Version: 6.1
Java Vendor: Sun Microsystems Inc.
Java Version: 1.6.0_24
Classpath: C:\Program Files\jTSS\lib\iaik_jtss_tcs.jar;C:\Program Files\jTSS\lib
\iaik_jtss_tcs_soap.jar;C:\Program Files\jTSS\lib\iaik_jtss_tsp.jar;C:\Program F
iles\jTSS\lib\iaik_jtss_tsp_soap.jar;C:\Program Files\jTSS\ext_libs\hsqldbmin.ja
r;C:\Program Files\jTSS\ext_libs\activation.jar;C:\Program Files\jTSS\ext_libs\a
xis-ant.jar;C:\Program Files\jTSS\ext_libs\axis.jar;C:\Program Files\jTSS\ext_li
bs\commons-daemon.jar;C:\Program Files\jTSS\ext_libs\commons-discovery-0.2.jar;C
:\Program Files\jTSS\ext_libs\commons-logging-1.0.4.jar;C:\Program Files\jTSS\ex
t_libs\jaxrpc.jar;C:\Program Files\jTSS\ext_libs\log4j-1.2.8.jar;C:\Program File
s\jTSS\ext_libs\mail.jar;C:\Program Files\jTSS\ext_libs\saaj.jar;C:\Program File
s\jTSS\ext_libs\wsdl4j-1.5.1.jar;C:\Program Files\jTSS\ext_libs\xerces.jar;C:\js
r321\JSR321~3\lib\junit.jar;C:\jsr321\JSR321~3\lib\asm-all.jar;C:\jsr321\JSR321~
3\jsr321-tck-utils.jar;C:\jsr321\JSR321~3\..\jsr321-api\jsr321.jar;C:\jsr321\JSR
321~3\..\jsr321-ri\jsr321-ri.jar;C:\jsr321\JSR321~3\classes\

................................................................................
.....E....E.E...
Time: 1,787.026
There were 3 failures:
1) testValidateCertifiedStatefulBindingKeyWithSigningKey(javax.trustedcomputing.
tpm.tools.CertifierTest)
junit.framework.AssertionFailedError: ValidationData does not contain correct PCR info
        at junit.framework.Assert.fail(Assert.java:50)
        at junit.framework.Assert.assertTrue(Assert.java:20)
        at javax.trustedcomputing.tpm.tools.CertifierTest.testValidateCertifiedStatefulBindingKeyWithSigningKey(CertifierTest.java:176)
...
2) testCertifierAnalysisMethods(javax.trustedcomputing.tpm.tools.CertifierTest)
junit.framework.AssertionFailedError: containsPCRInfo() failed!
        at junit.framework.Assert.fail(Assert.java:50)
        at junit.framework.Assert.assertTrue(Assert.java:20)
        at javax.trustedcomputing.tpm.tools.CertifierTest.testCertifierAnalysisMethods(CertifierTest.java:363)

...
3) testRemoteCertifierAnalysisMethods(javax.trustedcomputing.tpm.tools.CertifierTest)
junit.framework.AssertionFailedError: containsPCRInfo() failed!
        at junit.framework.Assert.fail(Assert.java:50)
        at junit.framework.Assert.assertTrue(Assert.java:20)
        at javax.trustedcomputing.tpm.tools.CertifierTest.testRemoteCertifierAnalysisMethods(CertifierTest.java:421)
..

FAILURES!!!
Tests run: 94,  Failures: 3 

Lenovo T61p

This Atmel TPM returns illegal Quote results and unexpected validation data in key certification.

  ------------
   JSR321 TCK 
  ------------
JUnit version 4.9b3
Reading TrustedComputingSuite test configuration from system property jsr321.tck
.abstracttestcaseconfig..OK.

*** JSR321 TCK Test Suite Configuration Information***
tpmContextImplementation: iaik.tc.jsr321.tpm.TPMContextImpl
tpmContextConnectionURL: null
aikKeyUUID: 519e5562-abf0-4515-84b4-d7f8a441a2ad

*** JSR321 TCK Version Information***
TPM Manufacturer: ATML
TPM Version: 1.2
TPM Firmware Version: 13.9
TSS Vendor: IAIK
TSS Version: Version: 1.2.0.7
JSR321 Specification Revision: 11.09
JSR321 Implementation Version: 1.0

*** JSR321 TCK System Information***
Operating System: Windows 7
System Architecture: amd64
Operating System Version: 6.1
Java Vendor: Sun Microsystems Inc.
Java Version: 1.6.0_21
Classpath: C:\Program Files\jTSS\lib\iaik_jtss_tcs.jar;C:\Program Files\jTSS\lib
\iaik_jtss_tcs_soap.jar;C:\Program Files\jTSS\lib\iaik_jtss_tsp.jar;C:\Program F
iles\jTSS\lib\iaik_jtss_tsp_soap.jar;C:\Program Files\jTSS\ext_libs\hsqldbmin.ja
r;C:\Program Files\jTSS\ext_libs\activation.jar;C:\Program Files\jTSS\ext_libs\a
xis-ant.jar;C:\Program Files\jTSS\ext_libs\axis.jar;C:\Program Files\jTSS\ext_li
bs\commons-daemon.jar;C:\Program Files\jTSS\ext_libs\commons-discovery-0.2.jar;C
:\Program Files\jTSS\ext_libs\commons-logging-1.0.4.jar;C:\Program Files\jTSS\ex
t_libs\jaxrpc.jar;C:\Program Files\jTSS\ext_libs\log4j-1.2.8.jar;C:\Program File
s\jTSS\ext_libs\mail.jar;C:\Program Files\jTSS\ext_libs\saaj.jar;C:\Program File
s\jTSS\ext_libs\wsdl4j-1.5.1.jar;C:\Program Files\jTSS\ext_libs\xerces.jar;C:\js
r321\JSR321~1\lib\junit.jar;C:\jsr321\JSR321~1\lib\asm-all.jar;C:\jsr321\JSR321~
1\jsr321-tck-utils.jar;C:\jsr321\JSR321~1\..\jsr321-api\jsr321.jar;C:\jsr321\JSR
321~1\..\jsr321-ri\jsr321-ri.jar;C:\jsr321\JSR321~1\classes\

Certifier.certifyKey() returned an invalid signature. This is a known issue of I
nfineon TPMs with firmware version< 3.17.


......................................................................E.E.E.E.E............E........
Time: 1.428,611
There were 6 failures:
1) testQuoteSigningKey(javax.trustedcomputing.tpm.tools.AttestorTest)
junit.framework.AssertionFailedError: The returned validation data signature could not be verified!
	at junit.framework.Assert.fail(Assert.java:50)
	at junit.framework.Assert.assertTrue(Assert.java:20)
	at javax.trustedcomputing.tpm.tools.AttestorTest.testQuoteSigningKey(AttestorTest.java:72)
...
2) testQuoteIdentityKey(javax.trustedcomputing.tpm.tools.AttestorTest)
iaik.tc.jsr321.TrustedComputingExceptionImpl: Quote operation failed.
	at iaik.tc.jsr321.tpm.tools.AttestorImpl.quote(Unknown Source)
	at javax.trustedcomputing.tpm.tools.AttestorTest.testQuoteIdentityKey(AttestorTest.java:94)
...
 Caused by: iaik.tc.tss.api.exceptions.tsp.TcTspException: 
TSS Error:
error layer:                0x3000 (TSP)
error code (without layer): 0x04
error code (full):          0x3004
error message: An internal SW error has been detected.
additional info: 
TSS Error:
error layer:                0x3000 (TSP)
error code (without layer): 0x04
error code (full):          0x3004
error message: unknown
additional info: GeneralSecurityException: Data must start with zero

	at iaik.tc.tss.impl.java.tsp.TcHash.verifySignature(TcHash.java:390)
	at iaik.tc.tss.impl.java.tsp.TcTpm.quote2(TcTpm.java:1553)
	... 33 more
3) testValidateQuoteSigningKey(javax.trustedcomputing.tpm.tools.AttestorTest)
junit.framework.AssertionFailedError: The returned quote couldn't be validated!
	at junit.framework.Assert.fail(Assert.java:50)
	at junit.framework.Assert.assertTrue(Assert.java:20)
	at javax.trustedcomputing.tpm.tools.AttestorTest.testValidateQuoteSigningKey(AttestorTest.java:139)
...

4) testValidateQuoteIdentityKey(javax.trustedcomputing.tpm.tools.AttestorTest)
iaik.tc.jsr321.TrustedComputingExceptionImpl: Quote operation failed.
	at iaik.tc.jsr321.tpm.tools.AttestorImpl.quote(Unknown Source)
	at javax.trustedcomputing.tpm.tools.AttestorTest.testValidateQuoteIdentityKey(AttestorTest.java:160)
...

Caused by: iaik.tc.tss.api.exceptions.tsp.TcTspException: 
TSS Error:
error layer:                0x3000 (TSP)
error code (without layer): 0x04
error code (full):          0x3004
error message: An internal SW error has been detected.
additional info: 
TSS Error:
error layer:                0x3000 (TSP)
error code (without layer): 0x04
error code (full):          0x3004
error message: unknown
additional info: GeneralSecurityException: Data must start with zero

	at iaik.tc.tss.impl.java.tsp.TcHash.verifySignature(TcHash.java:390)
	at iaik.tc.tss.impl.java.tsp.TcTpm.quote2(TcTpm.java:1553)
	... 33 more
5) testValidateQuoteSigningKeyRemote(javax.trustedcomputing.tpm.tools.AttestorTest)
junit.framework.AssertionFailedError: The returned quote couldn't be validated!
	at junit.framework.Assert.fail(Assert.java:50)
	at junit.framework.Assert.assertTrue(Assert.java:20)
	at javax.trustedcomputing.tpm.tools.AttestorTest.testValidateQuoteSigningKeyRemote(AttestorTest.java:203)
...

6) testValidateCertifiedStatefulBindingKeyWithSigningKey(javax.trustedcomputing.tpm.tools.CertifierTest)
junit.framework.AssertionFailedError: The key couldn't be verified with the given validation data!
	at junit.framework.Assert.fail(Assert.java:50)
	at junit.framework.Assert.assertTrue(Assert.java:20)
	at javax.trustedcomputing.tpm.tools.CertifierTest.testValidateCertifiedStatefulBindingKeyWithSigningKey(CertifierTest.java:177)
...


FAILURES!!!
Tests run: 94,  Failures: 6

HP dc7900

The TPM firmware orginally shipping with this desktop computer does show bugs when certifying keys.

Reading TrustedComputingSuite test configuration from system property jsr321.tck
.abstracttestcaseconfig..OK.

*** JSR321 TCK Test Suite Configuration Information***
tpmContextImplementation: iaik.tc.jsr321.tpm.TPMContextImpl
tpmContextConnectionURL: null
aikKeyUUID: 116649ac-e15e-4d83-b01a-8c37e6319f8b

*** JSR321 TCK Version Information***
TPM Manufacturer: IFX
TPM Version: 1.2
TPM Firmware Version: 3.16
TSS Vendor: IAIK
TSS Version: Version: 1.2.0.7
JSR321 Specification Revision: 11.09
JSR321 Implementation Version: 1.0

*** JSR321 TCK System Information***
Operating System: Windows 7
System Architecture: x86
Operating System Version: 6.1
Java Vendor: Sun Microsystems Inc.
Java Version: 1.6.0_26
Classpath: C:\Program Files\jTSS\lib\iaik_jtss_tcs.jar;C:\Program Files\jTSS\lib
\iaik_jtss_tcs_soap.jar;C:\Program Files\jTSS\lib\iaik_jtss_tsp.jar;C:\Program F
iles\jTSS\lib\iaik_jtss_tsp_soap.jar;C:\Program Files\jTSS\ext_libs\hsqldbmin.ja
r;C:\Program Files\jTSS\ext_libs\activation.jar;C:\Program Files\jTSS\ext_libs\a
xis-ant.jar;C:\Program Files\jTSS\ext_libs\axis.jar;C:\Program Files\jTSS\ext_li
bs\commons-daemon.jar;C:\Program Files\jTSS\ext_libs\commons-discovery-0.2.jar;C
:\Program Files\jTSS\ext_libs\commons-logging-1.0.4.jar;C:\Program Files\jTSS\ex
t_libs\jaxrpc.jar;C:\Program Files\jTSS\ext_libs\log4j-1.2.8.jar;C:\Program File
s\jTSS\ext_libs\mail.jar;C:\Program Files\jTSS\ext_libs\saaj.jar;C:\Program File
s\jTSS\ext_libs\wsdl4j-1.5.1.jar;C:\Program Files\jTSS\ext_libs\xerces.jar;C:\js
r321\JSR321~3\lib\junit.jar;C:\jsr321\JSR321~3\lib\asm-all.jar;C:\jsr321\JSR321~
3\jsr321-tck-utils.jar;C:\jsr321\JSR321~3\..\jsr321-api\jsr321.jar;C:\jsr321\JSR
321~3\..\jsr321-ri\jsr321-ri.jar;C:\jsr321\JSR321~3\classes\

Certifier.certifyKey() returned an invalid signature. This is a known issue of I
nfineon TPMs with firmware version< 3.17.
Certifier.certifyKey() returned an invalid signature. This is a known issue of I
nfineon TPMs with firmware version< 3.17.
Certifier.certifyKey() returned an invalid signature. This is a known issue of I
nfineon TPMs with firmware version< 3.17.
Certifier.certifyKey() returned an invalid signature. This is a known issue of I
nfineon TPMs with firmware version< 3.17.
Certifier.certifyKey() returned an invalid signature. This is a known issue of I
nfineon TPMs with firmware version< 3.17.

C:\jsr321\JSR321~3
  ------------
   JSR321 TCK 
  ------------
JUnit version 4.9b3
.....................................................................................E.E.E.E...E...
Time: 1.707,642
There were 5 failures:
1) testValidateCertifiedKeyWithSigningKey(javax.trustedcomputing.tpm.tools.CertifierTest)
junit.framework.AssertionFailedError: The key couldn't be verified with the given validation data!
	at junit.framework.Assert.fail(Assert.java:50)
	at junit.framework.Assert.assertTrue(Assert.java:20)
	at javax.trustedcomputing.tpm.tools.CertifierTest.testValidateCertifiedKeyWithSigningKey(CertifierTest.java:129)
...

2) testValidateCertifiedStatefulBindingKeyWithSigningKey(javax.trustedcomputing.tpm.tools.CertifierTest)
junit.framework.AssertionFailedError: The key couldn't be verified with the given validation data!
	at junit.framework.Assert.fail(Assert.java:50)
	at junit.framework.Assert.assertTrue(Assert.java:20)
	at javax.trustedcomputing.tpm.tools.CertifierTest.testValidateCertifiedStatefulBindingKeyWithSigningKey(CertifierTest.java:177)
...	
3) testValidateCertifiedKeyWithLegacyKey(javax.trustedcomputing.tpm.tools.CertifierTest)
junit.framework.AssertionFailedError: The key couldn't be verified with the given validation data!
	at junit.framework.Assert.fail(Assert.java:50)
	at junit.framework.Assert.assertTrue(Assert.java:20)
	at javax.trustedcomputing.tpm.tools.CertifierTest.testValidateCertifiedKeyWithLegacyKey(CertifierTest.java:226)

...
4) testValidateCertifiedKeyWithIndentityKey(javax.trustedcomputing.tpm.tools.CertifierTest)
junit.framework.AssertionFailedError: The key couldn't be verified with the given validation data!
	at junit.framework.Assert.fail(Assert.java:50)
	at junit.framework.Assert.assertTrue(Assert.java:20)
	at javax.trustedcomputing.tpm.tools.CertifierTest.testValidateCertifiedKeyWithIndentityKey(CertifierTest.java:264)
...
5) testRemoteCertifierAnalysisMethods(javax.trustedcomputing.tpm.tools.CertifierTest)
junit.framework.AssertionFailedError: Remote validation failed.
	at junit.framework.Assert.fail(Assert.java:50)
	at junit.framework.Assert.assertTrue(Assert.java:20)
	at javax.trustedcomputing.tpm.tools.CertifierTest.testRemoteCertifierAnalysisMethods(CertifierTest.java:424)
...
	
FAILURES!!!
Tests run: 94,  Failures: 5


Template

Paste results here..

Difference compared to previous revision
<span>............. Time: 1.716,43 OK (94 tests)<span style="text-decoration:underline;color:green"></pre> === HP dc7900 === <pre> ------------ JSR321 TCK ------------ JUnit version 4.9b3 Reading TrustedComputingSuite test configuration from system property jsr321.tck .abstracttestcaseconfig..OK. . *** JSR321 TCK Test Suite Configuration Information*** tpmContextImplementation: iaik.tc.jsr321.tpm.TPMContextImpl tpmContextConnectionURL: null aikKeyUUID: 1072c269-f3f3-4a84-a25f-8c055c51bc18 *** JSR321 TCK Version Information*** TPM Manufacturer: IFX TPM Version: 1.2 TPM Firmware Version: 3.17 TSS Vendor: IAIK TSS Version: Version: 1.2.0.7 JSR321 Specification Revision: 11.09 JSR321 Implementation Version: 1.0 *** JSR321 TCK System Information*** Operating System: Windows 7 System Architecture: x86 Operating System Version: 6.1 Java Vendor: Sun Microsystems Inc. Java Version: 1.5.0_22 Classpath: C:\Program Files\jTSS\lib\iaik_jtss_tcs.jar;C:\Program Files\jTSS\lib \iaik_jtss_tcs_soap.jar;C:\Program Files\jTSS\lib\iaik_jtss_tsp.jar;C:\Program F iles\jTSS\lib\iaik_jtss_tsp_soap.jar;C:\Program Files\jTSS\ext_libs\hsqldbmin.ja r;C:\Program Files\jTSS\ext_libs\activation.jar;C:\Program Files\jTSS\ext_libs\a xis-ant.jar;C:\Program Files\jTSS\ext_libs\axis.jar;C:\Program Files\jTSS\ext_li bs\commons-daemon.jar;C:\Program Files\jTSS\ext_libs\commons-discovery-0.2.jar;C :\Program Files\jTSS\ext_libs\commons-logging-1.0.4.jar;C:\Program Files\jTSS\ex t_libs\jaxrpc.jar;C:\Program Files\jTSS\ext_libs\log4j-1.2.8.jar;C:\Program File s\jTSS\ext_libs\mail.jar;C:\Program Files\jTSS\ext_libs\saaj.jar;C:\Program File s\jTSS\ext_libs\wsdl4j-1.5.1.jar;C:\Program Files\jTSS\ext_libs\xerces.jar;C:\js r321\JSR321~3\lib\junit.jar;C:\jsr321\JSR321~3\lib\asm-all.jar;C:\jsr321\JSR321~ 3\jsr321-tck-utils.jar;C:\jsr321\JSR321~3\..\jsr321-api\jsr321.jar;C:\jsr321\JSR 321~3\..\jsr321-ri\jsr321-ri.jar;C:\jsr321\JSR321~3\classes\ ................................................................................ ............. Time: 2.006,906 OK (94 tests) </span> </pre> <span>
 
 
Close
loading
Please Confirm
Close