Skip to main content

Source code file content

Revision: 114

» Project Revision History

» Checkout URL

soatestingutilities / ConsolidatedTestEnv / synchronous.txt

Size: 1084 bytes, 1 line
Testsuite: unittests.patterns.services.SynchronousServiceUnitTest
Tests run: 1, Failures: 0, Errors: 0, Time elapsed: 6.16 sec
------------- Standard Error -----------------
Feb 06, 2012 12:30:52 PM oracle.security.jps.internal.config.xml.XmlConfigurationFactory initDefaultConfiguration
SEVERE: java.io.FileNotFoundException: C:\_mywork\FusionApps\FATOOLS\ConsolidatedTestEnv\.\config\jps-config.xml (The system cannot find the path specified)
Feb 06, 2012 12:30:53 PM oracle.security.jps.internal.config.xml.XmlConfigurationFactory initDefaultConfiguration
SEVERE: java.io.FileNotFoundException: C:\_mywork\FusionApps\FATOOLS\ConsolidatedTestEnv\.\config\jps-config.xml (The system cannot find the path specified)
INFO: WSM-09004 Component auditing cannot be initialized.
SEVERE: java.io.FileNotFoundException: C:\_mywork\FusionApps\FATOOLS\ConsolidatedTestEnv\.\config\jps-config.xml (The system cannot find the path specified)
INFO: WSM-09004 Component auditing cannot be initialized.
------------- ---------------- ---------------

Testcase: testSync took 6.136 sec
 
 
Close
loading
Please Confirm
Close