Skip to main content

Source code file content

Revision: 114

» Project Revision History

» Checkout URL

soatestingutilities / SOAInstallationTester / asynchronous.txt

Size: 574 bytes, 1 line
Testsuite: service.unit.testing.ASyncOneWayUnitTest
Tests run: 1, Failures: 1, Errors: 0, Time elapsed: 0.559 sec
------------- Standard Output ---------------
Loading Test Data from [service-test-02.properties]
Test is finished.
------------- ---------------- ---------------

Testcase: testASyncOneWay took 0.545 sec
	FAILED
java.lang.RuntimeException: java.lang.NullPointerException
junit.framework.AssertionFailedError: java.lang.RuntimeException: java.lang.NullPointerException
	at service.unit.testing.ASyncOneWayUnitTest.testASyncOneWay(ASyncOneWayUnitTest.java:89)

 
 
Close
loading
Please Confirm
Close